{"text_format":"3","workbook":"xlsx","n_sheets":22,"sheets":["analytical_sample","chromatography","MS_analyzer","MS_peaks","NMR_peaks_all","NMR_analyzer","NMR_peaks_H1D","NMR_peaks_C1D","JRES","COSY","NOESY","TOCSY","HSQC","HMBC","carbon-13-1D_acquisition","CPMG-1D_acquisition","NOESY-1D_acquisition","other","validation","form_data","database_data","MS_help"],"not_rendered":{"images":3,"macros":1,"defined_names":1},"read":"whole","date_system":"1900"}

{"sheet":"analytical_sample","index":0,"n_rows":99,"n_cols":10,"rows_kept":99,"merged":[[2,0,2,1],[13,0,13,1],[18,0,18,1],[28,0,43,0],[48,0,63,0]]}
["sample type","chemical library compound (single)",{"$nulls":7},"x"]
[{"$nulls":9},"x"]
["NMR tube preparation",{"$nulls":8},"/!\\ nmr only"]
["solvent","D2O","Mandatory","|=> choose in list",{"$nulls":5},"/!\\ nmr only"]
["sample pH or sample apparent pH",7,"Mandatory if aqueous solvant",{"$nulls":6},"/!\\ nmr only"]
["reference chemical shif indicator","TSP","Optional","|=> choose in list",{"$nulls":5},"/!\\ nmr only"]
["reference chemical shif indicator (other)",null,"Optional",{"$nulls":6},"/!\\ nmr only"]
["reference concentration (mmol/L)",1,"Optional",{"$nulls":6},"/!\\ nmr only"]
["lock substance","D2O","Optional","|=> choose in list",{"$nulls":5},"/!\\ nmr only"]
["lock substance concentration (volumic %)",100,"Optional",{"$nulls":6},"/!\\ nmr only"]
["buffer solution","potassium and sodium phosphate","Optional","|=> choose in list",{"$nulls":5},"/!\\ nmr only"]
["buffer solution concentration (mmol/L)",200,"Optional",{"$nulls":6},"/!\\ nmr only"]
[{"$nulls":9},"/!\\ nmr only"]
["Isotopic Labelling",{"$nulls":8},"/!\\ nmr only"]
["Deuterium Isotopic Labelling","no","Optional","|=> choose in list",{"$nulls":5},"/!\\ nmr only"]
["Carbon 13 Isotopic Labelling","no","Optional","|=> choose in list",{"$nulls":5},"/!\\ nmr only"]
["Nitrogen 15 Isotopic Labelling","no","Optional","|=> choose in list",{"$nulls":5},"/!\\ nmr only"]
[{"$nulls":9},"x"]
["chemical compound from chemical library",{"$nulls":8},"x"]
["InChIKey",null,"Mandatory",{"$nulls":6},"x"]
["concentration (mmol/L)",null,"Optional (quantification)",{"$nulls":6},"x"]
["solvent",null,"Optional",{"$nulls":6},"/!\\ mass only"]
["InChI",null,"very optional",{"$nulls":6},"x"]
["molecule common name","mix","very optional",{"$nulls":6},"x"]
[{"$nulls":9},"x"]
["chemical compound mix",{"$nulls":8},"x"]
["solvent",{"$nulls":8},"x"]
[{"$nulls":9},"x"]
["reference compound added","common name","InChIKey*","composition","concentration (µg/ml)","exact mass","(M+H)+ or (M-H)-","*:mandatory",null,"x"]
[{"$nulls":9},"x"]
[{"$nulls":9},"x"]
[{"$nulls":9},"x"]
[{"$nulls":9},"x"]
[{"$nulls":9},"x"]
[{"$nulls":9},"x"]
[{"$nulls":9},"x"]
[{"$nulls":9},"x"]
[{"$nulls":9},"x"]
[{"$nulls":9},"x"]
[{"$nulls":9},"x"]
[{"$nulls":9},"x"]
[{"$nulls":9},"x"]
[{"$nulls":9},"x"]
[{"$nulls":9},"x"]
[{"$nulls":9},"x"]
["standardized matrix",{"$nulls":8},"x"]
["matrix type",{"$nulls":8},"x"]
[{"$nulls":9},"x"]
["reference compound added","common name","InChIKey*","composition","concentration (µg/ml)","exact mass","(M+H)+ or (M-H)-","*:mandatory",null,"x"]
[{"$nulls":9},"x"]
[{"$nulls":9},"x"]
[{"$nulls":9},"x"]
[{"$nulls":9},"x"]
[{"$nulls":9},"x"]
[{"$nulls":9},"x"]
[{"$nulls":9},"x"]
[{"$nulls":9},"x"]
[{"$nulls":9},"x"]
[{"$nulls":9},"x"]
[{"$nulls":9},"x"]
[{"$nulls":9},"x"]
[{"$nulls":9},"x"]
[{"$nulls":9},"x"]
[{"$nulls":7},"Note: let unused cells empty",null,"x"]
[{"$nulls":9},"x"]
["analytical matrix (biological)",{"$nulls":8},"x"]
["matrix type",null,"Note: if your source / type is not listed, please regenerate your template via the PeakForest web-application",{"$nulls":6},"x"]
[{"$nulls":9},"x"]
[{"$nulls":9},"x"]
[{"$nulls":9},"x"]
[{"$nulls":9},"x"]
[{"$nulls":9},"x"]
[{"$nulls":9},"x"]
[{"$nulls":9},"x"]
[{"$nulls":9},"x"]
[{"$nulls":9},"x"]
[{"$nulls":9},"x"]
[{"$nulls":9},"x"]
[{"$nulls":9},"x"]
[{"$nulls":9},"x"]
[{"$nulls":9},"x"]
[{"$nulls":9},"x"]
[{"$nulls":9},"x"]
[{"$nulls":9},"x"]
[{"$nulls":9},"x"]
[{"$nulls":9},"x"]
[{"$nulls":9},"x"]
[{"$nulls":9},"x"]
[{"$nulls":9},"x"]
[{"$nulls":9},"x"]
[{"$nulls":9},"x"]
[{"$nulls":9},"x"]
[{"$nulls":9},"x"]
[{"$nulls":9},"x"]
[{"$nulls":9},"x"]
[{"$nulls":9},"x"]
[{"$nulls":9},"x"]
[{"$nulls":9},"x"]
["x","x","x","x","x","x","x","x","x","x"]

{"sheet":"chromatography","index":1,"n_rows":50,"n_cols":10,"rows_kept":50,"hidden":true,"merged":[[2,0,2,1],[6,0,6,1],[18,0,18,3],[33,0,40,0]]}
["chromatography","LC",{"$nulls":7},"x"]
[{"$nulls":9},"x"]
["No Chromatography",{"$nulls":8},"x"]
["analysis volume (ml)",{"$nulls":8},"x"]
["sample weight (mg)",{"$nulls":8},"x"]
[{"$nulls":9},"x"]
["Gaz Chromatography",{"$nulls":8},"x"]
["Method",{"$nulls":8},"x"]
["Column constructor",{"$nulls":8},"x"]
["Column name",{"$nulls":8},"x"]
["Column length (m)",{"$nulls":8},"x"]
["Column diameter (mm)",{"$nulls":8},"x"]
["Particule size (µm)",{"$nulls":8},"x"]
["Year of purchase",{"$nulls":8},"x"]
["Injection volume (µL)",{"$nulls":8},"x"]
["He flow (mL/min)",{"$nulls":8},"x"]
["GC mode",{"$nulls":8},"x"]
[{"$nulls":9},"x"]
["Liquid Chromatography",{"$nulls":3},"WARNING: this sheet has not been checked",{"$nulls":4},"x"]
["Method",{"$nulls":4},"|=> choose in list",{"$nulls":3},"x"]
["Column constructor",{"$nulls":4},"|=> choose in list",{"$nulls":3},"x"]
["Column constructor (other)",{"$nulls":8},"x"]
["Column name",{"$nulls":8},"x"]
["Column length (mm)",{"$nulls":3},"Mandatory",{"$nulls":4},"x"]
["Column diameter (mm)",{"$nulls":3},"Mandatory",{"$nulls":4},"x"]
["Particule size (µm)",{"$nulls":3},"Mandatory",{"$nulls":4},"x"]
["Column temperature (°C)",{"$nulls":8},"x"]
["LC mode",{"$nulls":4},"|=> choose in list",{"$nulls":3},"x"]
["Separation flow rate (µL/min)",{"$nulls":8},"x"]
["Separation solvent A",{"$nulls":4},"|=> choose in list",{"$nulls":3},"x"]
["pH solvent A",{"$nulls":3},"Optional (only if aqueous solvent)",{"$nulls":4},"x"]
["Separation solvent B",{"$nulls":4},"|=> choose in list",{"$nulls":3},"x"]
["pH solvent B",{"$nulls":3},"Optional (only if aqueous solvent)",{"$nulls":4},"x"]
["Separation flow gradient","time (min)","solv. A (%)","solv. B (%)",{"$nulls":5},"x"]
[{"$nulls":9},"x"]
[{"$nulls":9},"x"]
[{"$nulls":9},"x"]
[{"$nulls":9},"x"]
[{"$nulls":9},"x"]
[{"$nulls":9},"x"]
[{"$nulls":9},"x"]
[{"$nulls":9},"x"]
[{"$nulls":9},"x"]
[{"$nulls":9},"x"]
[{"$nulls":9},"x"]
[{"$nulls":9},"x"]
[{"$nulls":9},"x"]
[{"$nulls":9},"x"]
[{"$nulls":9},"x"]
["x","x","x","x","x","x","x","x","x","x"]

{"sheet":"MS_analyzer","index":2,"n_rows":120,"n_cols":26,"rows_kept":120,"hidden":true,"merged":[[0,0,0,1],[8,4,8,5],[8,10,8,11],[10,11,11,11],[10,12,11,12],[16,9,16,10],[17,13,17,14],[17,15,17,16],[17,17,17,18],[17,19,18,19]]}
["Analyzer",{"$nulls":22},"x",null,"x"]
["analyzer type",null,"|=> Ion analyzer types are \"B\", \"E\", \"FT\" (inculde other types using FT like FTICR or Orbitrap), \"IT\", \"Q\", \"TOF\" (e.g.: \"QTOF\", \"QQQ\", \"EB\", \"ITFT\")*",{"$nulls":20},"x",null,"x"]
["manufacturer brands",null,null,"*for further informations please refer to MassBank Record documentation: ",{"$nulls":19},"x",null,"x"]
["|--- empty ---","|--- empty ---"]
["Detector",{"$nulls":24},"x"]
["Detection protocol",{"$nulls":24},"x"]
[{"$nulls":3},"http://www.massbank.jp/manuals/MassBankRecord_en.pdf",{"$nulls":19},"x",null,"x"]
["Molecule ionization","mode pos","mode neg",{"$nulls":20},"x",null,"x"]
["Ionization method",null,null,"|=> choose in list","Ion storage: Ion trap (IT) and ICR",{"$nulls":5},"Ion beam: q or h collision Cell (QqQ, QqIT, Qq/TOF, Fusion)",{"$nulls":12},"x"]
["High voltage (ESI) /                 Corona voltage (APCI)",null,null,"|=> in kV","Gas",null,null,"|=> i f FT/ICR in SORI-CID ",null,null,"Gas",{"$nulls":12},"x"]
["Spray (needle) gaz flow",null,null,"|=> arbitrary in Xcalibur","Gas pressure (mbar or a.u.)",null,null,"|=> if FT-/CR in SORI-CID & IT\n(optional field)",null,null,"Gas pressure",{"$nulls":12},"x"]
["Vaporizer temperature",null,null,"|=> in °C","Frequency shift (KHz)",null,null,"|=> if FT/ICR in SORI-CID ",null,null,"(mbar or a.u.)",{"$nulls":12},"x",null,"x"]
["Source gas flow",null,null,"|=> arbitrary in Xcalibur","Ion number (AGC or ICC)",null,null,"|=> if IT",{"$nulls":15},"x",null,"x"]
["Vaporizer gas flow",null,null,"|=> arbitrary in Xcalibur",{"$nulls":19},"x",null,"x"]
["Ion transfer tube temperature / Transfer capillary temperature",null,null,"|=> in °C",{"$nulls":19},"x",null,"x"]
["Desolvation zone \n(S-lens, funnels, ddp)",null,null,"|=> in % or V",{"$nulls":19},"x",null,"x"]
[{"$nulls":9},"Ion storage",{"$nulls":13},"x",null,"x"]
["scan type","polarity","resolution","Resolution FWHM\n(m/z)/D(m/z)","precursor spectrum \nsheet name*","Precursor ion m/z*","Isolation mode","Isolation window","Center of isolation window","qz isolation / activation (no unit)","Activation time (ms)","Mode","Frag. energy ","m/z range",null,"retention time  \n(help in cell V:19)",null,"retention time (% solvant)",null,"sheet",{"$nulls":5},"x"]
["choose in list","choose in list","choose in list","format: resolution@mass\n(Resolution applied in the method)","copy/past parent spectrum sheet's name (replace \"create\" button)","(2 digits of precision)","IT/q/TOF/ICR","(+/-value)",null,"if IT","if FT-ICR (SORI-CID) or IT","HCD / CID / ECD /ETD","without unit","from","to","from (min)","to (min)","from (%CH3OH)","to  (%CH3OH)",{"$nulls":6},"x"]
["ms",null,"high",{"$nulls":18},"note about retention time range:",{"$nulls":3},"x"]
["ms",null,"high",{"$nulls":19},"if you choose to take the RT at the curve apex (tangent), set the same value for the FROM and the TO fields.",null,null,"x"]
["ms",null,"high",{"$nulls":18},"note about retention time in % solvant:",{"$nulls":3},"x"]
["ms",null,"high",{"$nulls":19},"this data is optional, however if you are able to fulfill it, we are greateful!",null,null,"x"]
["ms",null,"high",{"$nulls":22},"x"]
["ms",null,"high",{"$nulls":22},"x"]
["ms",null,"high",{"$nulls":22},"x"]
["ms",null,"high",{"$nulls":22},"x"]
["ms",null,"high",{"$nulls":22},"x"]
["ms",null,"high",{"$nulls":22},"x"]
["ms",null,"high",{"$nulls":22},"x"]
["ms",null,"high",{"$nulls":22},"x"]
["ms",null,"high",{"$nulls":22},"x"]
["ms",null,"high",{"$nulls":22},"x"]
["ms",null,"high",{"$nulls":22},"x"]
["ms",null,"high",{"$nulls":22},"x"]
["ms",null,"high",{"$nulls":22},"x"]
["ms",null,"high",{"$nulls":22},"x"]
["ms",null,"high",{"$nulls":22},"x"]
["ms",null,"high",{"$nulls":22},"x"]
["ms",null,"high",{"$nulls":22},"x"]
["ms",null,"high",{"$nulls":22},"x"]
["ms",null,"high",{"$nulls":22},"x"]
["ms",null,"high",{"$nulls":22},"x"]
["ms",null,"high",{"$nulls":22},"x"]
["ms",null,"high",{"$nulls":22},"x"]
["ms",null,"high",{"$nulls":22},"x"]
["ms",null,"high",{"$nulls":22},"x"]
["ms",null,"high",{"$nulls":22},"x"]
["ms",null,"high",{"$nulls":22},"x"]
["ms",null,"high",{"$nulls":22},"x"]
["ms",null,"high",{"$nulls":22},"x"]
["ms",null,"high",{"$nulls":22},"x"]
["ms",null,"high",{"$nulls":22},"x"]
["ms",null,"high",{"$nulls":22},"x"]
["ms",null,"high",{"$nulls":22},"x"]
["ms",null,"high",{"$nulls":22},"x"]
["ms",null,"high",{"$nulls":22},"x"]
["ms",null,"high",{"$nulls":22},"x"]
["ms",null,"high",{"$nulls":22},"x"]
["ms",null,"high",{"$nulls":22},"x"]
["ms",null,"high",{"$nulls":22},"x"]
["ms",null,"high",{"$nulls":22},"x"]
["ms",null,"high",{"$nulls":22},"x"]
["ms",null,"high",{"$nulls":22},"x"]
["ms",null,"high",{"$nulls":22},"x"]
["ms",null,"high",{"$nulls":22},"x"]
["ms",null,"high",{"$nulls":22},"x"]
["ms",null,"high",{"$nulls":22},"x"]
["ms",null,"high",{"$nulls":22},"x"]
["ms",null,"high",{"$nulls":22},"x"]
["ms",null,"high",{"$nulls":22},"x"]
["ms",null,"high",{"$nulls":22},"x"]
["ms",null,"high",{"$nulls":22},"x"]
["ms",null,"high",{"$nulls":22},"x"]
["ms",null,"high",{"$nulls":22},"x"]
["ms",null,"high",{"$nulls":22},"x"]
["ms",null,"high",{"$nulls":22},"x"]
["ms",null,"high",{"$nulls":22},"x"]
["ms",null,"high",{"$nulls":22},"x"]
["ms",null,"high",{"$nulls":22},"x"]
["ms",null,"high",{"$nulls":22},"x"]
["ms",null,"high",{"$nulls":22},"x"]
["ms",null,"high",{"$nulls":22},"x"]
["ms",null,"high",{"$nulls":22},"x"]
["ms",null,"high",{"$nulls":22},"x"]
["ms",null,"high",{"$nulls":22},"x"]
["ms",null,"high",{"$nulls":22},"x"]
["ms",null,"high",{"$nulls":22},"x"]
["ms",null,"high",{"$nulls":22},"x"]
["ms",null,"high",{"$nulls":22},"x"]
["ms",null,"high",{"$nulls":22},"x"]
["ms",null,"high",{"$nulls":22},"x"]
["ms",null,"high",{"$nulls":22},"x"]
["ms",null,"high",{"$nulls":22},"x"]
["ms",null,"high",{"$nulls":22},"x"]
["ms",null,"high",{"$nulls":22},"x"]
["ms",null,"high",{"$nulls":22},"x"]
["ms",null,"high",{"$nulls":22},"x"]
["ms",null,"high",{"$nulls":22},"x"]
[{"$nulls":25},"x"]
[{"$nulls":25},"x"]
[{"$nulls":25},"x"]
[{"$nulls":25},"x"]
[{"$nulls":25},"x"]
[{"$nulls":25},"x"]
[{"$nulls":25},"x"]
[{"$nulls":25},"x"]
[{"$nulls":25},"x"]
[{"$nulls":25},"x"]
[{"$nulls":25},"x"]
[{"$nulls":25},"x"]
[{"$nulls":25},"x"]
[{"$nulls":25},"x"]
[{"$nulls":25},"x"]
[{"$nulls":25},"x"]
[{"$nulls":25},"x"]
[{"$nulls":25},"x"]
[{"$nulls":25},"x"]
[{"$nulls":25},"x"]
["x","x","x","x","x","x","x","x","x","x","x","x","x","x","x","x","x","x","x","x","x","x","x","x","x","x"]

{"sheet":"MS_peaks","index":3,"n_rows":100,"n_cols":27,"rows_kept":100,"hidden":true,"merged":[[4,0,5,0],[6,0,7,0]]}
["scan type","ms",{"$nulls":3},"Curation","no curation",null,"identified compound",{"$nulls":17},"x"]
["polarity",{"$nulls":7},"identified compound",{"$nulls":17},"x"]
["frag. energy (eV)*",{"$nulls":25},"x"]
["parent ion mass*",{"$nulls":25},"x"]
["mass range","from","to",{"$nulls":23},"x"]
[{"$nulls":26},"x"]
["retention time","from (min)","to (min)","from (%CH3OH)","to (%CH3OH)",{"$nulls":21},"x"]
[{"$nulls":26},"x"]
[{"$nulls":26},"x"]
["m/z","absolute intensity","relative intensity (%)","theo. mass","delta (ppm)","RDB equiv","composition","attribution","putative cpd name","putative cpd inchikey","identification level*",null,"*cf Sumner et al, \"Proposed quantitative and alphanumeric metabolite identification metrics\", Metabolomics (2014) ",{"$nulls":13},"x"]
[{"$nulls":10},"Confident identifications",null,"DOI 10.1007/s11306-014-0739-6",{"$nulls":13},"x"]
[{"$nulls":10},"Confident identifications",{"$nulls":15},"x"]
[{"$nulls":10},"Confident identifications",{"$nulls":15},"x"]
[{"$nulls":10},"Confident identifications",{"$nulls":15},"x"]
[{"$nulls":10},"Confident identifications",{"$nulls":15},"x"]
[{"$nulls":10},"Confident identifications",{"$nulls":15},"x"]
[{"$nulls":10},"Confident identifications",{"$nulls":15},"x"]
[{"$nulls":10},"Confident identifications",{"$nulls":15},"x"]
[{"$nulls":10},"Confident identifications",{"$nulls":15},"x"]
[{"$nulls":10},"Confident identifications",{"$nulls":15},"x"]
[{"$nulls":10},"Confident identifications",{"$nulls":15},"x"]
[{"$nulls":10},"Confident identifications",{"$nulls":15},"x"]
[{"$nulls":10},"Confident identifications",{"$nulls":15},"x"]
[{"$nulls":10},"Confident identifications",{"$nulls":15},"x"]
[{"$nulls":10},"Confident identifications",{"$nulls":15},"x"]
[{"$nulls":10},"Confident identifications",{"$nulls":15},"x"]
[{"$nulls":10},"Confident identifications",{"$nulls":15},"x"]
[{"$nulls":10},"Confident identifications",{"$nulls":15},"x"]
[{"$nulls":10},"Confident identifications",{"$nulls":15},"x"]
[{"$nulls":10},"Confident identifications",{"$nulls":15},"x"]
[{"$nulls":10},"Confident identifications",{"$nulls":15},"x"]
[{"$nulls":10},"Confident identifications",{"$nulls":15},"x"]
[{"$nulls":10},"Confident identifications",{"$nulls":15},"x"]
[{"$nulls":10},"Confident identifications",{"$nulls":15},"x"]
[{"$nulls":10},"Confident identifications",{"$nulls":15},"x"]
[{"$nulls":10},"Confident identifications",{"$nulls":15},"x"]
[{"$nulls":10},"Confident identifications",{"$nulls":15},"x"]
[{"$nulls":10},"Confident identifications",{"$nulls":15},"x"]
[{"$nulls":10},"Confident identifications",{"$nulls":15},"x"]
[{"$nulls":10},"Confident identifications",{"$nulls":15},"x"]
[{"$nulls":10},"Confident identifications",{"$nulls":15},"x"]
[{"$nulls":10},"Confident identifications",{"$nulls":15},"x"]
[{"$nulls":10},"Confident identifications",{"$nulls":15},"x"]
[{"$nulls":10},"Confident identifications",{"$nulls":15},"x"]
[{"$nulls":10},"Confident identifications",{"$nulls":15},"x"]
[{"$nulls":10},"Confident identifications",{"$nulls":15},"x"]
[{"$nulls":10},"Confident identifications",{"$nulls":15},"x"]
[{"$nulls":10},"Confident identifications",{"$nulls":15},"x"]
[{"$nulls":10},"Confident identifications",{"$nulls":15},"x"]
[{"$nulls":10},"Confident identifications",{"$nulls":15},"x"]
[{"$nulls":10},"Confident identifications",{"$nulls":15},"x"]
[{"$nulls":10},"Confident identifications",{"$nulls":15},"x"]
[{"$nulls":10},"Confident identifications",{"$nulls":15},"x"]
[{"$nulls":10},"Confident identifications",{"$nulls":15},"x"]
[{"$nulls":10},"Confident identifications",{"$nulls":15},"x"]
[{"$nulls":10},"Confident identifications",{"$nulls":15},"x"]
[{"$nulls":10},"Confident identifications",{"$nulls":15},"x"]
[{"$nulls":10},"Confident identifications",{"$nulls":15},"x"]
[{"$nulls":10},"Confident identifications",{"$nulls":15},"x"]
[{"$nulls":10},"Confident identifications",{"$nulls":15},"x"]
[{"$nulls":26},"x"]
[{"$nulls":26},"x"]
[{"$nulls":26},"x"]
[{"$nulls":26},"x"]
[{"$nulls":26},"x"]
[{"$nulls":26},"x"]
[{"$nulls":26},"x"]
[{"$nulls":26},"x"]
[{"$nulls":26},"x"]
[{"$nulls":26},"x"]
[{"$nulls":26},"x"]
[{"$nulls":26},"x"]
[{"$nulls":26},"x"]
[{"$nulls":26},"x"]
[{"$nulls":26},"x"]
[{"$nulls":26},"x"]
[{"$nulls":26},"x"]
[{"$nulls":26},"x"]
[{"$nulls":26},"x"]
[{"$nulls":26},"x"]
[{"$nulls":26},"x"]
[{"$nulls":26},"x"]
[{"$nulls":26},"x"]
[{"$nulls":26},"x"]
[{"$nulls":26},"x"]
[{"$nulls":26},"x"]
[{"$nulls":26},"x"]
[{"$nulls":26},"x"]
[{"$nulls":26},"x"]
[{"$nulls":26},"x"]
[{"$nulls":26},"x"]
[{"$nulls":26},"x"]
[{"$nulls":26},"x"]
[{"$nulls":26},"x"]
[{"$nulls":26},"x"]
[{"$nulls":26},"x"]
[{"$nulls":26},"x"]
[{"$nulls":26},"x"]
[{"$nulls":26},"x"]
["x","x","x","x","x",null,"x","x","x","x","x","x","x","x","x","x","x","x","x","x","x","x","x","x","x","x","x"]

{"sheet":"NMR_peaks_all","index":4,"n_rows":72,"n_cols":11,"rows_kept":72,"hidden":true}
["proton nmr peaks"]
["peak index","region","index (F1)","ν (F1) [ppm]","ν (F1) [Hz]","intensity [abs]","intensity [rel]","half width [ppm]","half width [Hz]","annotation"]
[{"$nulls":10},"|=> leave unused rows empty"]
{"$rows_empty":13}
[{"$nulls":10},"|=> you can insert new rows here"]
[]
["proton nmr peaks + sat"]
["peak index","region","index (F1)","ν (F1) [ppm]","ν (F1) [Hz]","intensity [abs]","intensity [rel]","half width [ppm]","half width [Hz]","annotation"]
[{"$nulls":10},"|=> leave unused rows empty"]
{"$rows_empty":12}
[{"$nulls":10},"|=> you can insert new rows here"]
[]
["multiplet",null,null,"use \",\" as separator","[ppm1 .. ppm2]"]
["ν (F1) [ppm]","H's","type","J(Hz)","range (ppm)","atoms","MSI level"]
[{"$nulls":7},"|=> leave unused rows empty"]
[{"$nulls":7},"|=> MSI level: used for biomatrix (later)"]
[{"$nulls":7},"NOTE:  if completed, image of the molecule with atom number attribution"]
[]
[]
[]
[]
[]
[]
[{"$nulls":7},"|=> you can insert new rows here"]
[]
[]
["carbon"]
["peak index","region","index (F1)","ν (F1) [ppm]","ν (F1) [Hz]","intensity [abs]","intensity [rel]","half width [ppm]","half width [Hz]","annotation"]
[{"$nulls":10},"|=> leave unused rows empty"]
[]
[]
[]
[]
[]
[]
[{"$nulls":10},"|=> you can insert new rows here"]
[]
["HSQC"]
["1H (ppm)","13C (ppm)","Atoms"]
[{"$nulls":3},"|=> leave unused rows empty"]
[]
[{"$nulls":3},"NOTE:  if completed, image of the molecule with atom number attribution"]
[]
[]
[]
[]
[]
[]
[{"$nulls":3},"|=> you can insert new rows here"]

{"sheet":"NMR_analyzer","index":5,"n_rows":177,"n_cols":10,"rows_kept":177,"merged":[[11,0,11,1],[21,0,21,1],[32,0,32,1],[44,0,44,1],[56,0,56,1],[70,0,70,1],[85,0,85,1],[101,0,101,1],[117,0,117,1],[135,0,135,1]]}
["Instrument",{"$nulls":8},"x"]
["Instrument name","Avance III","Optional","|=> choose in list",{"$nulls":5},"x"]
["Magnetic field strength (MHz)",600,"Mandatory","|=> choose in list",{"$nulls":5},"x"]
["Software","TopSpin 3.2","Optional","|=> choose in list",{"$nulls":5},"x"]
["NMR probe","CQPCI","Mandatory","|=> choose in list",{"$nulls":5},"x"]
["Cell or Tube","tube","Mandatory","|=> choose in list",{"$nulls":5},"x"]
["NMR tube diameter (mm)",5,"Mandatory if Tube","|=> choose in list",{"$nulls":5},"x"]
["Flow cell volume (µl)","","Mandatory if Cell",{"$nulls":6},"x"]
[{"$nulls":9},"x"]
["NOTE: in a futur release of this file, you could choose the acquisition.",null,null,"WARNING: mandatory / optional fields are still in discussion",{"$nulls":5},"x"]
[{"$nulls":6},"hint: also know in topsin as value…","label in file \"acqu\" with prefix",null,"x"]
["Proton acquisition (1D)",null,null,"Spectra processing parameters",{"$nulls":5},"x"]
["Pulse sequence",null,"Mandatory","Fourier transform","true ",null,"PULPROG","##$PULPROG =<…>",null,"x"]
["Pulse angle (°)",null,"Optional","SI",null,"|=> choose in list","F1","?",null,"x"]
["Number of points",null,"Optional","Line broadening",null,null,"TD","##$TD",null,"x"]
["Number of scans",null,"Optional",{"$nulls":3},"NS","##$NS",null,"x"]
["Temperature (K)",null,"Mandatory",{"$nulls":3},"TE","##$TE",null,"x"]
["Relaxation delay D1 (s)",null,"Optional",{"$nulls":3},"DS","##$DS",null,"x"]
["SW (ppm)",null,"Optional",{"$nulls":3},"SW","##$SW",null,"x"]
[{"$nulls":9},"x"]
[{"$nulls":9},"x"]
["NOESY acquisition (1D)",null,null,"Spectra processing parameters",{"$nulls":5},"x"]
["Pulse sequence","noesypr1d","Mandatory","Fourier transform","true ",null,"PULPROG","##$PULPROG =<…>",null,"x"]
["Pulse angle (°)",null,"Default: 90°, set if different","SI","64k","|=> choose in list","F1","?",null,"x"]
["Number of points",32768,"Optional","Line broadening",0.3,null,"TD","##$TD",null,"x"]
["Number of scans",16,"Optional",{"$nulls":3},"NS","##$NS",null,"x"]
["Temperature (K)",300,"Mandatory",{"$nulls":3},"TE","##$TE",null,"x"]
["Relaxation delay D1 (s)",2,"Optional",{"$nulls":3},"DS","##$DS",null,"x"]
["SW (ppm)",20,"Optional",{"$nulls":3},"SW","##$SW",null,"x"]
["Mixing time (s)",0.1,"Optional",{"$nulls":3},"D8","##D = (value 9, start at 0)",null,"x"]
[null,"NOESY-1D_acquisition",{"$nulls":7},"x"]
[{"$nulls":9},"x"]
["CPMG acquisition (1D)",null,null,"Spectra processing parameters",{"$nulls":5},"x"]
["Pulse sequence","cpmgpr1d","Mandatory","Fourier transform","true ",null,"PULPROG","##$PULPROG =<…>",null,"x"]
["Pulse angle (°)",null,"Optional","SI","64k","|=> choose in list",{"$nulls":3},"x"]
["Number of points",32768,"Optional","Line broadening",0.3,null,"TD","##$TD",null,"x"]
["Number of scans",16,"Optional",{"$nulls":3},"NS","##$NS",null,"x"]
["Temperature (K)",300,"Mandatory",{"$nulls":3},"TE","##$TE",null,"x"]
["Relaxation delay D1 (s)",2,"Optional",{"$nulls":3},"DS","##$DS",null,"x"]
["SW (ppm)",20,"Optional",{"$nulls":3},"SW","##$SW",null,"x"]
["Spin-echo delay (µs)",400,"Optional",{"$nulls":6},"x"]
["Number of loops",80,"Optional",{"$nulls":6},"x"]
[null,"CPMG-1D_acquisition",{"$nulls":7},"x"]
[{"$nulls":9},"x"]
["Carbon-13 acquisition (1D)",null,null,"Spectra processing parameters",{"$nulls":5},"x"]
["Pulse sequence","zgpg30","Mandatory","Fourier transform","true ",null,"PULPROG","##$PULPROG =<…>",null,"x"]
["Pulse angle (°)",null,"Optional","SI","64k","|=> choose in list",{"$nulls":3},"x"]
["Number of points",65536,"Optional","Line broadening",1,null,"TD","##$TD",null,"x"]
["Number of scans",2048,"Optional",{"$nulls":3},"NS","##$NS",null,"x"]
["Temperature (K)",300,"Mandatory",{"$nulls":3},"TE","##$TE",null,"x"]
["Relaxation delay D1 (s)",5,"Optional",{"$nulls":6},"x"]
["SW (ppm)",240,"Optional",{"$nulls":3},"SW","##$SW",null,"x"]
["Decoupling?","yes","|=> choose in list (y/n)",{"$nulls":6},"x"]
["Decoupling type","waltz16","Optional (if decoupling is \"yes\")",{"$nulls":6},"x"]
[null,"carbon-13-1D_acquisition",{"$nulls":7},"x"]
[{"$nulls":9},"x"]
["JRES acquisition (2D)",null,null,"Spectra processing parameters",{"$nulls":5},"x"]
["Pulse sequence","jresgpprqf","Mandatory","Fourier transform","true ",null,"PULPROG","##$PULPROG =<…>",null,"x"]
["size of FID (F1)",40,"Optional","tilt","yes","|=> choose in list (y/n)",{"$nulls":3},"x"]
["size of FID (F2)",8192,"Optional","SI (F1)",128,"|=> choose in list",{"$nulls":3},"x"]
["Number of scans (F2)",64,"Optional","SI (F2)","16k","|=> choose in list",{"$nulls":3},"x"]
["Acquisition mode for 2D (F1)","QF","Optional","Window function (F1)","SINE","|=> choose in list","NS","##$NS",null,"x"]
["Temperature (K)",300,"Mandatory","Window function (F2)","SINE","|=> choose in list","TE","##$TE",null,"x"]
["Relaxation delay D1 (s)",1.5,"Optional","SSB (F1)",0,"|=> only if SINE or QSINE","DS","##$DS",null,"x"]
["SW (ppm) F1",0.1562,"Optional","SSB (F2)",0,"|=> only if SINE or QSINE","SW","##$SW",null,"x"]
["SW (ppm) F2",10,"Optional","GB (F1)",0.1,"|=> only if GM",{"$nulls":3},"x"]
[null,"JRES"," ","GB (F2)",0,"|=> only if GM",{"$nulls":3},"x"]
[{"$nulls":3},"peak picking","manual","|=> choose in list",{"$nulls":3},"x"]
[{"$nulls":3},"Symmetrize","yes","|=> choose in list","DS",null,null,"x"]
[{"$nulls":9},"x"]
["COSY acquisition (2D)",null,null,"Spectra processing parameters",{"$nulls":5},"x"]
["Pulse sequence","cosygpprqf","Mandatory","Fourier transform","true ",{"$nulls":4},"x"]
["Pulse angle (°)",null,"Optional","SI (F1)",1024,"|=> choose in list",{"$nulls":3},"x"]
["size of FID (F1)",256,"Optional","SI (F2)","8192","|=> choose in list",{"$nulls":3},"x"]
["size of FID (F2)",8192,"Optional","Window function (F1)","QSINE","|=> choose in list",null,"##$PULPROG =<…>",null,"x"]
["Number of scans (F2)",8,"Optional","Window function (F2)","QSINE","|=> choose in list","PULPROG",null,null,"x"]
["Acquisition mode for 2D (F1)","QF","Optional","LB (F1)",0.3,"|=> only if EM",{"$nulls":3},"x"]
["Temperature (K)",300,"Mandatory","LB (F2)",1,"|=> only if EM",{"$nulls":3},"x"]
["Relaxation delay D1 (s)",1.5,"Optional","SSB (F1)",1,"|=> only if SINE or QSINE",null,"##$NS",null,"x"]
["SW (ppm) 1H",12,"Optional","SSB (F2)",1,"|=> only if SINE or QSINE","NS",null,null,"x"]
["NUS (Non Uniform Sampling)","no","Optional","GB (F1)",0.1,"|=> only if GM",{"$nulls":3},"x"]
["NUSAmount (%)",null,"Optional","GB (F2)",0,"|=> only if GM",null,"##$TE",null,"x"]
["Nus Points",null,"Optional","peak picking","manual","|=> choose in list","TE","##$DS",null,"x"]
[null,"COSY"," ","NUS processing parameter",null,null,"DS","##$SW",null,"x"]
[{"$nulls":6},"SW",null,null,"x"]
["TOCSY acquisition (2D)",null,null,"Spectra processing parameters",{"$nulls":5},"x"]
["Pulse sequence","mlevphpr.2","Mandatory","Fourier transform","true ",{"$nulls":4},"x"]
["Pulse angle (°)",null,"Optional","SI (F1)",1024,"|=> choose in list",{"$nulls":3},"x"]
["size of FID (F1)",256,"Optional","SI (F2)","8192","|=> choose in list",null,"##$PULPROG =<…>",null,"x"]
["size of FID (F2)",8192,"Optional","Window function (F1)","QSINE","|=> choose in list","PULPROG",null,null,"x"]
["Number of scans (F2)",8,"Optional","Window function (F2)","QSINE","|=> choose in list",{"$nulls":3},"x"]
["Acquisition mode for 2D (F1)","States-TPPI","Optional","LB (F1)",0.3,"|=> only if EM",{"$nulls":3},"x"]
["Mixing time (s)",0.08,"Optional","LB (F2)",1,"|=> only if EM",null,"##$NS",null,"x"]
["Temperature (K)",300,"Mandatory","SSB (F1)",2,"|=> only if SINE or QSINE","NS",null,null,"x"]
["Relaxation delay D1 (s)",2,"Optional","SSB (F2)",2,"|=> only if SINE or QSINE",{"$nulls":3},"x"]
["SW (ppm) 1H",12,"Optional","GB (F1)",0.1,"|=> only if GM",{"$nulls":3},"x"]
["NUS (Non Uniform Sampling)","no","Optional","GB (F2)",0,"|=> only if GM",null,"##$TE",null,"x"]
["NUSAmount (%)",null,"Optional","peak picking","manual","|=> choose in list","TE","##$DS",null,"x"]
["Nus Points",null,"Optional","NUS processing parameter",null,null,"DS","##$SW",null,"x"]
[null,"TOCSY"," ",{"$nulls":3},"SW",null,null,"x"]
[{"$nulls":9},"x"]
["NOESY (2D)",null,null,"Spectra processing parameters",{"$nulls":5},"x"]
["Pulse sequence",null,"Mandatory","Fourier transform","true ",{"$nulls":4},"x"]
["Pulse angle (°)",null,"Optional","SI (F1)",null,"|=> choose in list",{"$nulls":3},"x"]
["size of FID (F1)",null,"Optional","SI (F2)",null,"|=> choose in list",{"$nulls":3},"x"]
["size of FID (F2)",null,"Optional","Window function (F1)",null,"|=> choose in list",{"$nulls":3},"x"]
["Number of scans (F2)",null,"Optional","Window function (F2)",null,"|=> choose in list",{"$nulls":3},"x"]
["Acquisition mode for 2D (F1)",null,"Optional","LB (F1)",null,"|=> only if EM",{"$nulls":3},"x"]
["Temperature (K)",null,"Optional","LB (F2)",null,"|=> only if EM",{"$nulls":3},"x"]
["Relaxation delay D1 (s)",null,"Mandatory","SSB (F1)",null,"|=> only if SINE or QSINE",{"$nulls":3},"x"]
["Mixing time D8 (s)",null,"Optional","SSB (F2)",null,"|=> only if SINE or QSINE",{"$nulls":3},"x"]
["SW (ppm) 1H",null,"Optional","GB (F1)",null,"|=> only if GM",{"$nulls":3},"x"]
["NUS (Non Uniform Sampling)",null,"Optional","GB (F2)",null,"|=> only if GM",{"$nulls":3},"x"]
["NUSAmount (%)",null,"Optional","peak picking",null,"|=> choose in list",{"$nulls":3},"x"]
["Nus Points",null,"Optional","NUS processing parameter",{"$nulls":5},"x"]
[null,null," ",{"$nulls":6},"x"]
[{"$nulls":9},"x"]
["HSQC acquisition (2D)",null,null,"Spectra processing parameters",{"$nulls":5},"x"]
["Pulse sequence","hsqcetgp","Mandatory","Fourier transform","true ",{"$nulls":4},"x"]
["Pulse angle (°)",null,"Optional","SI (F1)",1024,"|=> choose in list",null,"##$PULPROG =<…>",null,"x"]
["size of FID (F1)",256,"Optional","SI (F2)","8192","|=> choose in list","PULPROG",null,null,"x"]
["size of FID (F2)",4096,"Optional","Window function (F1)","QSINE","|=> choose in list",{"$nulls":3},"x"]
["Number of scans (F2)",16,"Optional","Window function (F2)","QSINE","|=> choose in list",{"$nulls":3},"x"]
["Acquisition mode for 2D (F1)","Echo-antiecho","Optional","LB (F1)",0.3,"|=> only if EM",null,"##$NS",null,"x"]
["Temperature (K)",300,"Mandatory","LB (F2)",1,"|=> only if EM","NS",null,null,"x"]
["Relaxation delay D1 (s)",1.5,"Optional","SSB (F1)",2,"|=> only if SINE or QSINE",null,"##$TE",null,"x"]
["SW (ppm) 1H",12,"Optional","SSB (F2)",2,"|=> only if SINE or QSINE","TE","##$DS",null,"x"]
["SW (ppm) 13C",165,"Optional","GB (F1)",0.1,"|=> only if GM","DS","##$SW?",null,"x"]
["Decouplage type","garp4","Optional","GB (F2)",0,"|=> only if GM","SW?","##$SW?",null,"x"]
["JXH (Hz)",145,"Optional","peak picking","manual","|=> choose in list","SW?",null,null,"x"]
["NUS (Non Uniform Sampling)","no","Optional","NUS processing parameter",{"$nulls":5},"x"]
["NUSAmount (%)",null,"Optional",{"$nulls":6},"x"]
["Nus Points",null,"Optional",{"$nulls":6},"x"]
[null,"HSQC"," ",{"$nulls":6},"x"]
[{"$nulls":9},"x"]
["HMBC acquisition (2D)",null,null,"Spectra processing parameters",{"$nulls":5},"x"]
["Pulse sequence","hmbcgplpndprqf","Mandatory","Fourier transform","true ",{"$nulls":4},"x"]
["Pulse angle (°)",null,"Optional","SI (F1)",1024,"|=> choose in list",{"$nulls":3},"x"]
["size of FID (F1)",256,"Optional","SI (F2)","8192","|=> choose in list",{"$nulls":3},"x"]
["size of FID (F2)",4096,"Optional","Window function (F1)","QSINE","|=> choose in list",{"$nulls":3},"x"]
["Number of scans (F2)",16,"Optional","Window function (F2)","QSINE","|=> choose in list",{"$nulls":3},"x"]
["Acquisition mode for 2D (F1)","QF","Optional","LB (F1)",0.3,"|=> only if EM",{"$nulls":3},"x"]
["Temperature (K)",300,"Mandatory","LB (F2)",1,"|=> only if EM",{"$nulls":3},"x"]
["Relaxation delay D1 (s)",2,"Optional","SSB (F1)",1,"|=> only if SINE or QSINE",{"$nulls":3},"x"]
["SW (ppm) 1H (F2)",16,"Optional","SSB (F2)",1,"|=> only if SINE or QSINE",{"$nulls":3},"x"]
["SW (ppm) 13C (F1)",220,"Optional","GB (F1)",0.1,"|=> only if GM",{"$nulls":3},"x"]
["JXH long range (Hz)",6,"Optional","GB (F2)",0,"|=> only if GM",{"$nulls":3},"x"]
["NUS (Non Uniform Sampling)","no","Optional","peak picking","manual","|=> choose in list",{"$nulls":3},"x"]
["NUSAmount (%)",null,"Optional","NUS processing parameter",{"$nulls":5},"x"]
["Nus Points",null,"Optional",{"$nulls":6},"x"]
[null,"HMBC"," ",{"$nulls":6},"x"]
[{"$nulls":9},"x"]
[{"$nulls":9},"x"]
[{"$nulls":9},"x"]
[{"$nulls":9},"x"]
[{"$nulls":9},"x"]
[{"$nulls":9},"x"]
[{"$nulls":9},"x"]
[{"$nulls":9},"x"]
[{"$nulls":9},"x"]
[{"$nulls":9},"x"]
[{"$nulls":9},"x"]
[{"$nulls":9},"x"]
[{"$nulls":9},"x"]
[{"$nulls":9},"x"]
[{"$nulls":9},"x"]
[{"$nulls":9},"x"]
[{"$nulls":9},"x"]
[{"$nulls":9},"x"]
[{"$nulls":9},"x"]
[{"$nulls":9},"x"]
[{"$nulls":9},"x"]
[{"$nulls":9},"x"]
[{"$nulls":9},"x"]
[{"$nulls":9},"x"]
[{"$nulls":9},"x"]
["x","x","x","x","x","x","x","x","x","x"]

{"sheet":"NMR_peaks_H1D","index":6,"n_rows":100,"n_cols":26,"rows_kept":100,"hidden":true}
["proton nmr peaks",{"$nulls":24},"x"]
["peak index","region","index (F1)","ν (F1) [ppm]","ν (F1) [Hz]","intensity [abs]","intensity [rel]","half width [ppm]","half width [Hz]","annotation",{"$nulls":15},"x"]
[{"$nulls":10},"|=> leave unused rows empty",{"$nulls":14},"x"]
[{"$nulls":25},"x"]
[{"$nulls":25},"x"]
[{"$nulls":25},"x"]
[{"$nulls":25},"x"]
[{"$nulls":25},"x"]
[{"$nulls":25},"x"]
[{"$nulls":25},"x"]
[{"$nulls":25},"x"]
[{"$nulls":25},"x"]
[{"$nulls":25},"x"]
[{"$nulls":25},"x"]
[{"$nulls":25},"x"]
[{"$nulls":25},"x"]
[{"$nulls":10},"|=> you can insert new rows here",{"$nulls":14},"x"]
[{"$nulls":25},"x"]
["proton nmr peaks + sat",{"$nulls":24},"x"]
["peak index","region","index (F1)","ν (F1) [ppm]","ν (F1) [Hz]","intensity [abs]","intensity [rel]","half width [ppm]","half width [Hz]","annotation",{"$nulls":15},"x"]
[{"$nulls":10},"|=> leave unused rows empty",{"$nulls":14},"x"]
[{"$nulls":25},"x"]
[{"$nulls":25},"x"]
[{"$nulls":25},"x"]
[{"$nulls":25},"x"]
[{"$nulls":25},"x"]
[{"$nulls":25},"x"]
[{"$nulls":25},"x"]
[{"$nulls":25},"x"]
[{"$nulls":25},"x"]
[{"$nulls":25},"x"]
[{"$nulls":25},"x"]
[{"$nulls":25},"x"]
[{"$nulls":10},"|=> you can insert new rows here",{"$nulls":14},"x"]
[{"$nulls":25},"x"]
["multiplet",null,null,"use \";\" as separator","[ppm1 .. ppm2]",{"$nulls":20},"x"]
["ν (F1) [ppm]","H's","type","J(Hz)","range (ppm)","atoms","MSI level",{"$nulls":18},"x"]
[{"$nulls":7},"|=> leave unused rows empty",{"$nulls":17},"x"]
[{"$nulls":7},"|=> MSI level: used for biomatrix (later)",{"$nulls":17},"x"]
[{"$nulls":7},"NOTE:  if completed, image of the molecule with atom number attribution",{"$nulls":17},"x"]
[{"$nulls":25},"x"]
[{"$nulls":25},"x"]
[{"$nulls":25},"x"]
[{"$nulls":25},"x"]
[{"$nulls":25},"x"]
[{"$nulls":25},"x"]
[{"$nulls":7},"|=> you can insert new rows here",{"$nulls":17},"x"]
[{"$nulls":25},"x"]
[{"$nulls":25},"x"]
[{"$nulls":25},"x"]
[{"$nulls":25},"x"]
[{"$nulls":25},"x"]
[{"$nulls":25},"x"]
[{"$nulls":25},"x"]
[{"$nulls":25},"x"]
[{"$nulls":25},"x"]
[{"$nulls":25},"x"]
[{"$nulls":25},"x"]
[{"$nulls":25},"x"]
[{"$nulls":25},"x"]
[{"$nulls":25},"x"]
[{"$nulls":25},"x"]
[{"$nulls":25},"x"]
[{"$nulls":25},"x"]
[{"$nulls":25},"x"]
[{"$nulls":25},"x"]
[{"$nulls":25},"x"]
[{"$nulls":25},"x"]
[{"$nulls":25},"x"]
[{"$nulls":25},"x"]
[{"$nulls":25},"x"]
[{"$nulls":25},"x"]
[{"$nulls":25},"x"]
[{"$nulls":25},"x"]
[{"$nulls":25},"x"]
[{"$nulls":25},"x"]
[{"$nulls":25},"x"]
[{"$nulls":25},"x"]
[{"$nulls":25},"x"]
[{"$nulls":25},"x"]
[{"$nulls":25},"x"]
[{"$nulls":25},"x"]
[{"$nulls":25},"x"]
[{"$nulls":25},"x"]
[{"$nulls":25},"x"]
[{"$nulls":25},"x"]
[{"$nulls":25},"x"]
[{"$nulls":25},"x"]
[{"$nulls":25},"x"]
[{"$nulls":25},"x"]
[{"$nulls":25},"x"]
[{"$nulls":25},"x"]
[{"$nulls":25},"x"]
[{"$nulls":25},"x"]
[{"$nulls":25},"x"]
[{"$nulls":25},"x"]
[{"$nulls":25},"x"]
[{"$nulls":25},"x"]
[{"$nulls":25},"x"]
["x","x","x","x","x","x","x","x","x","x","x","x","x","x","x","x","x","x","x","x","x","x","x","x","x","x"]

{"sheet":"NMR_peaks_C1D","index":7,"n_rows":100,"n_cols":26,"rows_kept":100,"hidden":true}
["carbon",{"$nulls":24},"x"]
["peak index","region","index (F1)","ν (F1) [ppm]","ν (F1) [Hz]","intensity [abs]","intensity [rel]","half width [ppm]","half width [Hz]","annotation",{"$nulls":15},"x"]
[{"$nulls":10},"|=> leave unused rows empty",{"$nulls":14},"x"]
[{"$nulls":25},"x"]
[{"$nulls":25},"x"]
[{"$nulls":25},"x"]
[{"$nulls":25},"x"]
[{"$nulls":25},"x"]
[{"$nulls":25},"x"]
[{"$nulls":10},"|=> you can insert new rows here",{"$nulls":14},"x"]
[{"$nulls":25},"x"]
["multiplet","(if C-H and/or C-C coupling)",null,"use \",\" as separator","[ppm1 .. ppm2]",{"$nulls":20},"x"]
["ν (F1) [ppm]","C's","type","J(Hz)","range (ppm)","atoms","MSI level",{"$nulls":18},"x"]
[{"$nulls":7},"|=> leave unused rows empty",{"$nulls":17},"x"]
[{"$nulls":7},"|=> MSI level: used for biomatrix (later)",{"$nulls":17},"x"]
[{"$nulls":7},"NOTE:  if completed, image of the molecule with atom number attribution",{"$nulls":17},"x"]
[{"$nulls":25},"x"]
[{"$nulls":25},"x"]
[{"$nulls":25},"x"]
[{"$nulls":25},"x"]
[{"$nulls":25},"x"]
[{"$nulls":25},"x"]
[{"$nulls":7},"|=> you can insert new rows here",{"$nulls":17},"x"]
[{"$nulls":25},"x"]
[{"$nulls":25},"x"]
[{"$nulls":25},"x"]
[{"$nulls":25},"x"]
[{"$nulls":25},"x"]
[{"$nulls":25},"x"]
[{"$nulls":25},"x"]
[{"$nulls":25},"x"]
[{"$nulls":25},"x"]
[{"$nulls":25},"x"]
[{"$nulls":25},"x"]
[{"$nulls":25},"x"]
[{"$nulls":25},"x"]
[{"$nulls":25},"x"]
[{"$nulls":25},"x"]
[{"$nulls":25},"x"]
[{"$nulls":25},"x"]
[{"$nulls":25},"x"]
[{"$nulls":25},"x"]
[{"$nulls":25},"x"]
[{"$nulls":25},"x"]
[{"$nulls":25},"x"]
[{"$nulls":25},"x"]
[{"$nulls":25},"x"]
[{"$nulls":25},"x"]
[{"$nulls":25},"x"]
[{"$nulls":25},"x"]
[{"$nulls":25},"x"]
[{"$nulls":25},"x"]
[{"$nulls":25},"x"]
[{"$nulls":25},"x"]
[{"$nulls":25},"x"]
[{"$nulls":25},"x"]
[{"$nulls":25},"x"]
[{"$nulls":25},"x"]
[{"$nulls":25},"x"]
[{"$nulls":25},"x"]
[{"$nulls":25},"x"]
[{"$nulls":25},"x"]
[{"$nulls":25},"x"]
[{"$nulls":25},"x"]
[{"$nulls":25},"x"]
[{"$nulls":25},"x"]
[{"$nulls":25},"x"]
[{"$nulls":25},"x"]
[{"$nulls":25},"x"]
[{"$nulls":25},"x"]
[{"$nulls":25},"x"]
[{"$nulls":25},"x"]
[{"$nulls":25},"x"]
[{"$nulls":25},"x"]
[{"$nulls":25},"x"]
[{"$nulls":25},"x"]
[{"$nulls":25},"x"]
[{"$nulls":25},"x"]
[{"$nulls":25},"x"]
[{"$nulls":25},"x"]
[{"$nulls":25},"x"]
[{"$nulls":25},"x"]
[{"$nulls":25},"x"]
[{"$nulls":25},"x"]
[{"$nulls":25},"x"]
[{"$nulls":25},"x"]
[{"$nulls":25},"x"]
[{"$nulls":25},"x"]
[{"$nulls":25},"x"]
[{"$nulls":25},"x"]
[{"$nulls":25},"x"]
[{"$nulls":25},"x"]
[{"$nulls":25},"x"]
[{"$nulls":25},"x"]
[{"$nulls":25},"x"]
[{"$nulls":25},"x"]
[{"$nulls":25},"x"]
[{"$nulls":25},"x"]
[{"$nulls":25},"x"]
["x","x","x","x","x","x","x","x","x","x","x","x","x","x","x","x","x","x","x","x","x","x","x","x","x","x"]

{"sheet":"JRES","index":8,"n_rows":509,"n_cols":27,"rows_kept":509}
["JRES correlations",{"$nulls":4},"use \";\" as separator",{"$nulls":20},"x"]
["peak index","ν (F2) [ppm]","ν (F1) [ppm]","intensity [rel]","multiplicity","J (coupling constant)","annotation",{"$nulls":19},"x"]
[1,"0.9001","-0.0122","67435270.00",null,null,3,{"$nulls":19},"x"]
[2,"0.9004","-0.0005","137886444.00",null,null,2]
[3,"0.9004","0.0122","67435270.00",null,null,2]
[4,"0.9434","-0.0123","51800516.00",null,null,2]
[6,"0.9442","0.0122","51078020.00",null,null,2]
[5,"0.9445","0.0000","117285896.00"]
[7,"0.9977","-0.0060","104211480.00"]
[8,"0.9983","0.0059","103062752.00"]
[10,"1.0149","0.0056","116188552.00"]
[9,"1.0151","-0.0061","116188552.00"]
[11,"1.0486","-0.0059","97217820.00"]
[12,"1.0494","0.0058","82514638.00"]
[18,"1.2681","0.0251","4846952.00"]
[16,"1.2689","0.0024","6958546.00"]
[13,"1.2693","-0.0253","6006360.00"]
[15,"1.2693","-0.0028","7209780.00"]
[14,"1.2697","-0.0110","3268812.00"]
[17,"1.2697","0.0108","3268812.00"]
[21,"1.3348","-0.0060","81287086.00"]
[22,"1.3350","0.0055","67790732.00"]
[19,"1.3391","-0.0055","124881672.00"]
[20,"1.3395","0.0055","110666664.00"]
[24,"1.4555","0.0055","12972738.00"]
[23,"1.4556","-0.0057","18327166.00"]
[26,"1.4882","0.0057","138392710.00"]
[25,"1.4886","-0.0062","134946732.00"]
[30,"1.5627","0.0065","36958688.00"]
[31,"1.5631","0.0184","19541132.00"]
[27,"1.5632","-0.0308","4670812.00"]
[29,"1.5632","-0.0063","35674350.00"]
[28,"1.5633","-0.0187","19541132.00"]
[32,"1.5633","0.0305","4670812.00"]
[37,"1.7250","0.0257","8061554.00"]
[33,"1.7251","-0.0256","8061554.00"]
[35,"1.7251","-0.0001","14221396.00"]
[36,"1.7251","0.0133","8386708.00"]
[34,"1.7253","-0.0134","8386708.00"]
[38,"2.0078","-0.0211","5274118.00"]
[39,"2.0087","-0.0097","6651078.00"]
[40,"2.0087","-0.0021","2885346.00"]
[42,"2.0089","0.0101","6651078.00"]
[43,"2.0089","0.0207","3951178.00"]
[41,"2.0095","0.0020","2858690.00"]
[46,"2.1458","-0.0003","3931538.00"]
[45,"2.1469","-0.0132","6578304.00"]
[44,"2.1472","-0.0224","4075390.00"]
[48,"2.1472","0.0228","6121982.00"]
[47,"2.1478","0.0125","4394368.00"]
[50,"2.1635","0.0000","62288714.00"]
[51,"2.1635","0.0120","44167804.00"]
[49,"2.1638","-0.0124","39718750.00"]
[54,"2.2796","-0.0037","6568540.00"]
[55,"2.2804","0.0033","6123486.00"]
[57,"2.2807","0.0159","3633232.00"]
[52,"2.2810","-0.0150","3851918.00"]
[53,"2.2810","-0.0085","4019294.00"]
[56,"2.2810","0.0079","4015912.00"]
[59,"2.3543","-0.0042","4804480.00"]
[58,"2.3546","-0.0180","4142260.00"]
[60,"2.3548","0.0032","5165076.00"]
[61,"2.3551","0.0177","4026766.00"]
[63,"2.4235","-0.0075","11519716.00"]
[62,"2.4238","-0.0182","11455340.00"]
[64,"2.4238","0.0079","11967866.00"]
[65,"2.4243","0.0180","10099862.00"]
[69,"2.4375","0.0134","2804602.00"]
[67,"2.4377","-0.0134","3248832.00"]
[70,"2.4380","0.0251","5720274.00"]
[68,"2.4381","-0.0007","9013498.00"]
[66,"2.4382","-0.0258","5720274.00"]
[74,"2.4438","0.0002","9435998.00"]
[71,"2.4439","-0.0390","3545866.00"]
[72,"2.4439","-0.0276","3587628.00"]
[76,"2.4439","0.0273","3519178.00"]
[77,"2.4442","0.0375","4091176.00"]
[73,"2.4443","-0.0132","14864338.00"]
[75,"2.4448","0.0126","14389354.00"]
[79,"2.4581","-0.0070","1465696.00"]
[80,"2.4584","0.0064","771986.00"]
[81,"2.4589","0.0204","8506670.00"]
[78,"2.4592","-0.0213","8060902.00"]
[85,"2.4637","0.0179","8664582.00"]
[83,"2.4639","-0.0075","8432486.00"]
[82,"2.4643","-0.0193","7249742.00"]
[84,"2.4643","0.0074","8432486.00"]
[89,"2.4789","0.0126","1390494.00"]
[86,"2.4790","-0.0260","4535880.00"]
[87,"2.4791","-0.0142","1625738.00"]
[88,"2.4792","0.0000","4272038.00"]
[90,"2.4794","0.0256","4470910.00"]
[91,"2.6987","-0.0219","29444070.00"]
[93,"2.6987","0.0073","28979708.00"]
[94,"2.6987","0.0218","29444070.00"]
[92,"2.6991","-0.0076","28979708.00"]
[95,"2.7205","0.0000","529739012.00"]
[97,"2.8166","-0.0114","28665904.00"]
[98,"2.8169","0.0116","28665904.00"]
[99,"2.8177","0.0177","22239082.00"]
[96,"2.8185","-0.0177","13751326.00"]
[101,"2.8812","-0.0078","18576450.00"]
[103,"2.8812","0.0204","19460620.00"]
[102,"2.8820","0.0082","14312964.00"]
[100,"2.8827","-0.0211","12045766.00"]
[106,"2.9593","0.0102","20995046.00"]
[104,"2.9600","-0.0177","20520510.00"]
[105,"2.9600","-0.0103","20284142.00"]
[107,"2.9600","0.0177","17030774.00"]
[110,"3.0205","0.0126","44654220.00"]
[108,"3.0212","-0.0126","42072972.00"]
[109,"3.0220","-0.0004","21676600.00"]
[111,"3.2021","-0.0003","563066030.00"]
[112,"3.2280","-0.0002","286931602.00"]
[116,"3.2580","0.0146","15262222.00"]
[114,"3.2584","-0.0145","14510068.00"]
[115,"3.2589","-0.0001","43242750.00"]
[113,"3.2659","0.0000","438980414.00"]
[117,"3.3461","-0.0100","12435782.00"]
[118,"3.3461","0.0099","12435782.00"]
[120,"3.4123","0.0161","15436916.00"]
[119,"3.4128","-0.0157","14338318.00"]
[121,"3.4263","0.0000","17195124.00"]
[122,"3.4317","-0.0085","11297222.00"]
[123,"3.4325","0.0082","10438380.00"]
[126,"3.4741","0.0001","6835842.00"]
[124,"3.4745","-0.0110","7571782.00"]
[125,"3.4745","-0.0053","6369592.00"]
[127,"3.4745","0.0056","6259910.00"]
[128,"3.4753","0.0111","6533488.00"]
[129,"3.4757","0.0147","4152212.00"]
[130,"3.5033","-0.0156","18413738.00"]
[131,"3.5033","-0.0001","18391582.00"]
[132,"3.5033","0.0153","18665492.00"]
[134,"3.5189","0.0000","23084498.00"]
[135,"3.5193","0.0082","16082716.00"]
[133,"3.5197","-0.0083","16282472.00"]
[139,"3.5469","0.0116","11835302.00"]
[137,"3.5473","-0.0051","12407138.00"]
[138,"3.5473","0.0049","12407138.00"]
[136,"3.5481","-0.0117","6410798.00"]
[140,"3.5687","-0.0001","272063208.00"]
[142,"3.6020","0.0039","44890182.00"]
[141,"3.6022","-0.0040","44890182.00"]
[143,"3.6202","-0.0037","43288048.00"]
[144,"3.6203","0.0036","44439048.00"]
[145,"3.6571","-0.0113","19489902.00"]
[146,"3.6574","-0.0055","16183678.00"]
[147,"3.6574","0.0052","16241932.00"]
[148,"3.6577","0.0111","18956968.00"]
[149,"3.6809","-0.0036","43560788.00"]
[150,"3.6812","0.0036","43560788.00"]
[151,"3.7245","-0.0162","9490398.00"]
[152,"3.7247","0.0159","9490398.00"]
[156,"3.7320","0.0154","13390788.00"]
[154,"3.7321","-0.0053","13606514.00"]
[153,"3.7323","-0.0155","14805286.00"]
[155,"3.7323","0.0057","13845404.00"]
[157,"3.7393","-0.0002","10127194.00"]
[158,"3.7610","-0.0004","3180242.00"]
[160,"3.7639","0.0084","22764606.00"]
[159,"3.7645","-0.0085","17054694.00"]
[161,"3.7839","-0.0102","15470692.00"]
[162,"3.7839","-0.0001","19777476.00"]
[163,"3.7840","0.0100","15470692.00"]
[164,"3.7922","-0.0063","24658996.00"]
[166,"3.7923","-0.0186","8117810.00"]
[165,"3.7926","0.0058","24658996.00"]
[167,"3.7927","0.0183","7426944.00"]
[168,"3.8152","-0.0114","4225476.00"]
[170,"3.8156","0.0050","5167964.00"]
[169,"3.8159","-0.0055","5026204.00"]
[171,"3.8159","0.0117","6286770.00"]
[173,"3.8449","0.0094","8832974.00"]
[172,"3.8452","-0.0097","6284314.00"]
[174,"3.8640","-0.0111","5981732.00"]
[175,"3.8644","-0.0055","5586762.00"]
[176,"3.8644","0.0055","5586762.00"]
[177,"3.8644","0.0108","5732776.00"]
[183,"3.9007","-0.0101","6885328.00"]
[184,"3.9011","0.0096","8067234.00"]
[182,"3.9022","-0.0003","59639952.00"]
[179,"3.9059","-0.0039","18004390.00"]
[180,"3.9059","0.0039","18004390.00"]
[181,"3.9065","0.0101","18584952.00"]
[178,"3.9066","-0.0105","16769102.00"]
[185,"3.9388","0.0003","4510252.00"]
[186,"3.9654","0.0000","116933968.00"]
[187,"4.0129","-0.0105","12853570.00"]
[190,"4.0129","0.0097","16384608.00"]
[188,"4.0137","-0.0022","18774138.00"]
[189,"4.0137","0.0022","18774138.00"]
[192,"4.0635","-0.0008","11741966.00"]
[193,"4.0635","0.0083","2966062.00"]
[191,"4.0639","-0.0086","2966062.00"]
[203,"4.1186","-0.0172","3860684.00"]
[204,"4.1186","0.0175","3860684.00"]
[194,"4.1191","-0.0060","12329622.00"]
[195,"4.1196","0.0058","12329622.00"]
[199,"4.1397","0.0125","4867876.00"]
[196,"4.1402","-0.0131","4815388.00"]
[197,"4.1403","-0.0024","4901596.00"]
[198,"4.1405","0.0021","6001062.00"]
[200,"4.2621","-0.0100","12040694.00"]
[205,"4.2621","-0.0214","1264144.00"]
[202,"4.2623","0.0098","12040694.00"]
[201,"4.2624","-0.0005","9276948.00"]
[206,"4.2633","0.0205","2200978.00"]
[207,"4.5942","-0.0067","26733764.00"]
[208,"4.5954","0.0064","28845072.00"]
[210,"4.6563","0.0058","23883868.00"]
[209,"4.6575","-0.0069","10319226.00"]
[211,"5.2452","-0.0033","5237698.00"]
[212,"5.2452","0.0033","5237698.00"]
[213,"5.2771","-0.0042","2107820.00"]
[214,"5.2784","0.0028","2745920.00"]
[215,"6.5267","-0.0006","105864600.00"]
[216,"7.1584","-0.0003","2116408.00"]
[219,"7.2018","0.0119","5243570.00"]
[217,"7.2030","-0.0128","5060422.00"]
[218,"7.2036","-0.0006","10174768.00"]
[220,"7.2873","-0.0133","5865160.00"]
[222,"7.2873","0.0128","4726370.00"]
[221,"7.2879","-0.0006","11059206.00"]
[223,"7.3356","0.0000","9807286.00"]
[224,"7.5477","-0.0072","5412456.00"]
[225,"7.5483","0.0064","3027322.00"]
[228,"7.5550","0.0133","18050360.00"]
[227,"7.5556","0.0006","2159726.00"]
[226,"7.5562","-0.0136","18617624.00"]
[230,"7.6436","-0.0006","14056082.00"]
[229,"7.6442","-0.0125","5392714.00"]
[231,"7.6442","0.0125","5392714.00"]
[232,"7.7376","-0.0075","5100750.00"]
[233,"7.7394","0.0055","1665126.00"]
[234,"7.8340","-0.0072","14246122.00"]
[235,"7.8340","0.0069","14246122.00"]
[236,"8.0528","-0.0014","14545730.00"]
{"$rows_empty":175}
[{"$nulls":26},"x"]
[{"$nulls":26},"x"]
[{"$nulls":26},"x"]
[{"$nulls":26},"x"]
[{"$nulls":26},"x"]
[{"$nulls":26},"x"]
[{"$nulls":26},"x"]
[{"$nulls":26},"x"]
[{"$nulls":22},"x"]
[{"$nulls":22},"x"]
[{"$nulls":22},"x"]
[{"$nulls":22},"x"]
[{"$nulls":22},"x"]
[{"$nulls":22},"x"]
[{"$nulls":22},"x"]
[{"$nulls":22},"x"]
[{"$nulls":22},"x"]
[{"$nulls":22},"x"]
[{"$nulls":22},"x"]
[{"$nulls":22},"x"]
[{"$nulls":26},"x"]
[{"$nulls":26},"x"]
[{"$nulls":26},"x"]
[{"$nulls":26},"x"]
[{"$nulls":26},"x"]
[{"$nulls":26},"x"]
[{"$nulls":26},"x"]
[{"$nulls":26},"x"]
[{"$nulls":26},"x"]
[{"$nulls":26},"x"]
[{"$nulls":26},"x"]
[{"$nulls":26},"x"]
[{"$nulls":26},"x"]
[{"$nulls":26},"x"]
[{"$nulls":26},"x"]
[{"$nulls":26},"x"]
[{"$nulls":26},"x"]
[{"$nulls":26},"x"]
[{"$nulls":26},"x"]
[{"$nulls":26},"x"]
[{"$nulls":26},"x"]
[{"$nulls":26},"x"]
[{"$nulls":26},"x"]
[{"$nulls":26},"x"]
[{"$nulls":26},"x"]
[{"$nulls":26},"x"]
[{"$nulls":26},"x"]
[{"$nulls":26},"x"]
[{"$nulls":26},"x"]
[{"$nulls":26},"x"]
[{"$nulls":26},"x"]
[{"$nulls":26},"x"]
[{"$nulls":26},"x"]
[{"$nulls":26},"x"]
[{"$nulls":26},"x"]
[{"$nulls":26},"x"]
[{"$nulls":26},"x"]
[{"$nulls":26},"x"]
[{"$nulls":26},"x"]
[{"$nulls":26},"x"]
[{"$nulls":26},"x"]
[{"$nulls":26},"x"]
[{"$nulls":26},"x"]
[{"$nulls":26},"x"]
[{"$nulls":26},"x"]
[{"$nulls":26},"x"]
[{"$nulls":26},"x"]
[{"$nulls":26},"x"]
[{"$nulls":26},"x"]
[{"$nulls":26},"x"]
[{"$nulls":26},"x"]
[{"$nulls":26},"x"]
[{"$nulls":26},"x"]
[{"$nulls":26},"x"]
[{"$nulls":26},"x"]
[{"$nulls":26},"x"]
[{"$nulls":26},"x"]
[{"$nulls":26},"x"]
[{"$nulls":26},"x"]
[{"$nulls":26},"x"]
[{"$nulls":26},"x"]
[{"$nulls":26},"x"]
[{"$nulls":26},"x"]
[{"$nulls":26},"x"]
[{"$nulls":26},"x"]
[{"$nulls":26},"x"]
[{"$nulls":26},"x"]
[{"$nulls":26},"x"]
[{"$nulls":26},"x"]
[{"$nulls":26},"x"]
[{"$nulls":26},"x"]
[{"$nulls":26},"x"]
[{"$nulls":26},"x"]
[{"$nulls":26},"x"]
[{"$nulls":26},"x"]
["x","x",null,"x","x","x","x","x",null,"x","x","x","x","x","x","x","x","x","x","x","x","x","x","x","x","x","x"]

{"sheet":"COSY","index":9,"n_rows":300,"n_cols":26,"rows_kept":300}
["1H-1H  COSY NMR correlations",{"$nulls":24},"x"]
["peak index","ν (F2) [ppm]","ν (F1) [ppm]","intensity [rel]","annotation",{"$nulls":20},"x"]
[103,"0.9019","1.5635","459412.00",{"$nulls":21},"x"]
[101,"0.9454","1.2612","1898512.00"]
[102,"0.9468","1.4697","1498772.00"]
[100,"0.9958","2.2619","6164352.00"]
[98,"1.0165","1.9596","4643288.00"]
[99,"1.0489","2.2723","3077632.00"]
[107,"1.2346","0.9381","3747992.00"]
[104,"1.2684","1.4801","5282696.00"]
[105,"1.2732","1.9909","4438988.00"]
[106,"1.3015","0.9485","4298648.00"]
[96,"1.3360","4.1277","3559912.00"]
[108,"1.3388","2.1159","2402104.00"]
[97,"1.3443","4.2423","21085820.00"]
[110,"1.4588","4.8744","903112.00"]
[109,"1.4638","4.4563","951356.00"]
[94,"1.4802","1.7313","1167352.00"]
[93,"1.4828","0.9054","1273432.00"]
[95,"1.4921","3.7962","19711904.00"]
[91,"1.5631","0.9054","2114328.00"]
[92,"1.5657","2.1602","6971212.00"]
[90,"1.7263","3.0179","4116924.00"]
[89,"1.7276","1.4454","1540700.00"]
[87,"1.9894","1.0324","1814312.00"]
[88,"2.0118","3.3673","2785964.00"]
[86,"2.0822","2.3594","3486388.00"]
[85,"2.1433","2.4519","6609196.00"]
[84,"2.1493","3.7936","5845948.00"]
[83,"2.1651","1.5544","421208.00"]
[81,"2.2808","1.0270","4936924.00"]
[82,"2.2822","3.6270","5922116.00"]
[79,"2.3479","2.0541","3059800.00"]
[80,"2.3552","4.1267","5234388.00"]
[78,"2.4519","4.5893","1592404.00"]
[77,"2.4552","2.1559","8635548.00"]
[68,"2.6976","3.9094","5195080.00"]
[74,"2.7179","2.8154","12813236.00"]
[71,"2.7194","1.9306","4383620.00"]
[70,"2.7208","3.5153","3196228.00"]
[69,"2.7223","3.9014","3848420.00"]
[73,"2.8174","2.6787","1722464.00"]
[67,"2.8181","3.8934","186768.00"]
[66,"2.8813","4.0140","4899880.00"]
[72,"2.8827","2.9602","6920912.00"]
[75,"2.9452","2.9683","635652.00"]
[76,"2.9604","2.8798","2559796.00"]
[65,"2.9626","4.0221","1089724.00"]
[64,"3.0221","1.7214","8870268.00"]
[62,"3.2022","3.9818","6946988.00"]
[57,"3.2036","2.4293","7269504.00"]
[61,"3.2276","4.0060","13999696.00"]
[56,"3.2283","2.4615","7266096.00"]
[60,"3.2646","4.6334","2398740.00"]
[55,"3.2675","2.4856","7915884.00"]
[59,"3.2675","4.0140","4541200.00"]
[58,"3.2689","3.4670","2119232.00"]
[63,"3.3198","4.0542","7488688.00"]
[51,"3.4246","4.5637","9487604.00"]
[52,"3.4250","3.8344","1325420.00"]
[53,"3.4939","3.3035","6403120.00"]
[54,"3.4969","3.6359","6083420.00"]
[49,"3.5042","4.0542","7640236.00"]
[50,"3.5051","4.5905","13429848.00"]
[48,"3.5477","5.2340","1576152.00"]
[47,"3.5679","4.3331","1655352.00"]
[41,"3.5694","2.7615","640280.00"]
[46,"3.6041","4.2473","6825544.00"]
[40,"3.6237","2.2961","2914552.00"]
[44,"3.6562","3.4858","1010660.00"]
[45,"3.6592","3.9363","3491988.00"]
[39,"3.6795","2.0013","4582572.00"]
[42,"3.7285","3.4965","1000992.00"]
[43,"3.7367","4.0060","315668.00"]
[26,"3.7805","1.9237","891712.00"]
[27,"3.7865","2.1565","3802140.00"]
[25,"3.7956","1.4738","11394412.00"]
[37,"3.8197","5.2438","211148.00"]
[38,"3.8363","3.3821","1062856.00"]
[36,"3.8981","4.6697","1509940.00"]
[33,"3.9042","3.7079","5475556.00"]
[28,"3.9072","2.7150","5674924.00"]
[34,"3.9449","3.6458","3626944.00"]
[35,"3.9675","4.7473","1556512.00"]
[30,"4.0127","3.2424","1274208.00"]
[29,"4.0188","2.9166","8187728.00"]
[32,"4.0625","3.4907","4633896.00"]
[31,"4.0685","3.3045","3094264.00"]
[24,"4.0934","3.7084","1010632.00"]
[21,"4.1206","1.3208","6464516.00"]
[22,"4.1379","2.0574","1850328.00"]
[23,"4.1417","2.3283","3244828.00"]
[19,"4.2623","1.3293","8441416.00"]
[20,"4.2631","3.5983","7365424.00"]
[18,"4.4576","1.4478","2697440.00"]
[17,"4.5647","2.4468","1538344.00"]
[16,"4.5671","3.4212","2852272.00"]
[15,"4.5967","3.5101","565584.00"]
[14,"4.6569","3.2729","5981992.00"]
[13,"5.2454","3.5516","4999704.00"]
[12,"5.2781","3.8184","3205764.00"]
[11,"7.1580","8.0466","3798864.00"]
[10,"7.2013","7.7498","7400488.00"]
[9,"7.2049","7.2902","3338420.00"]
[8,"7.2880","7.1993","2995320.00"]
[7,"7.2892","7.5344","4159156.00"]
[5,"7.5480","7.2711","1154280.00"]
[6,"7.5564","7.8264","2289376.00"]
[4,"7.6419","7.5439","733848.00"]
[3,"7.7370","7.1993","11431352.00"]
[2,"7.8357","7.5583","3304728.00"]
[1,"8.0535","7.1514","2418896.00"]
{"$rows_empty":92}
[{"$nulls":25},"x"]
[{"$nulls":25},"x"]
[{"$nulls":25},"x"]
[{"$nulls":25},"x"]
[{"$nulls":25},"x"]
[{"$nulls":25},"x"]
[{"$nulls":25},"x"]
[{"$nulls":25},"x"]
[{"$nulls":25},"x"]
[{"$nulls":25},"x"]
[{"$nulls":25},"x"]
[{"$nulls":25},"x"]
[{"$nulls":25},"x"]
[{"$nulls":25},"x"]
[{"$nulls":25},"x"]
[{"$nulls":25},"x"]
[{"$nulls":25},"x"]
[{"$nulls":25},"x"]
[{"$nulls":25},"x"]
[{"$nulls":25},"x"]
[{"$nulls":25},"x"]
[{"$nulls":25},"x"]
[{"$nulls":25},"x"]
[{"$nulls":25},"x"]
[{"$nulls":25},"x"]
[{"$nulls":25},"x"]
[{"$nulls":25},"x"]
[{"$nulls":25},"x"]
[{"$nulls":25},"x"]
[{"$nulls":25},"x"]
[{"$nulls":25},"x"]
[{"$nulls":25},"x"]
[{"$nulls":25},"x"]
[{"$nulls":25},"x"]
[{"$nulls":25},"x"]
[{"$nulls":25},"x"]
[{"$nulls":25},"x"]
[{"$nulls":25},"x"]
[{"$nulls":25},"x"]
[{"$nulls":25},"x"]
[{"$nulls":25},"x"]
[{"$nulls":25},"x"]
[{"$nulls":25},"x"]
[{"$nulls":25},"x"]
[{"$nulls":25},"x"]
[{"$nulls":25},"x"]
[{"$nulls":25},"x"]
[{"$nulls":25},"x"]
[{"$nulls":25},"x"]
[{"$nulls":25},"x"]
[{"$nulls":25},"x"]
[{"$nulls":25},"x"]
[{"$nulls":25},"x"]
[{"$nulls":25},"x"]
[{"$nulls":25},"x"]
[{"$nulls":25},"x"]
[{"$nulls":25},"x"]
[{"$nulls":25},"x"]
[{"$nulls":25},"x"]
[{"$nulls":25},"x"]
[{"$nulls":25},"x"]
[{"$nulls":25},"x"]
[{"$nulls":25},"x"]
[{"$nulls":25},"x"]
[{"$nulls":25},"x"]
[{"$nulls":25},"x"]
[{"$nulls":25},"x"]
[{"$nulls":25},"x"]
[{"$nulls":25},"x"]
[{"$nulls":25},"x"]
[{"$nulls":25},"x"]
[{"$nulls":25},"x"]
[{"$nulls":25},"x"]
[{"$nulls":25},"x"]
[{"$nulls":25},"x"]
[{"$nulls":25},"x"]
[{"$nulls":25},"x"]
[{"$nulls":25},"x"]
[{"$nulls":25},"x"]
[{"$nulls":25},"x"]
[{"$nulls":25},"x"]
[{"$nulls":25},"x"]
[{"$nulls":25},"x"]
[{"$nulls":25},"x"]
[{"$nulls":25},"x"]
[{"$nulls":25},"x"]
[{"$nulls":25},"x"]
[{"$nulls":25},"x"]
[{"$nulls":25},"x"]
[{"$nulls":25},"x"]
[{"$nulls":25},"x"]
[{"$nulls":25},"x"]
[{"$nulls":25},"x"]
[{"$nulls":25},"x"]
[{"$nulls":25},"x"]
["x","x","x","x","x","x","x","x","x","x","x","x","x","x","x","x","x","x","x","x","x","x","x","x","x","x"]

{"sheet":"NOESY","index":10,"n_rows":100,"n_cols":26,"rows_kept":100,"hidden":true}
["1H-1H  NOESY NMR correlations",{"$nulls":24},"x"]
["peak index","ν (F2) [ppm]","ν (F1) [ppm]","intensity [rel]","annotation",{"$nulls":20},"x"]
[{"$nulls":25},"x"]
[{"$nulls":25},"x"]
[{"$nulls":25},"x"]
[{"$nulls":25},"x"]
[{"$nulls":25},"x"]
[{"$nulls":25},"x"]
[{"$nulls":25},"x"]
[{"$nulls":25},"x"]
[{"$nulls":25},"x"]
[{"$nulls":25},"x"]
[{"$nulls":25},"x"]
[{"$nulls":25},"x"]
[{"$nulls":25},"x"]
[{"$nulls":25},"x"]
[{"$nulls":25},"x"]
[{"$nulls":25},"x"]
[{"$nulls":25},"x"]
[{"$nulls":25},"x"]
[{"$nulls":25},"x"]
[{"$nulls":25},"x"]
[{"$nulls":25},"x"]
[{"$nulls":25},"x"]
[{"$nulls":25},"x"]
[{"$nulls":25},"x"]
[{"$nulls":25},"x"]
[{"$nulls":25},"x"]
[{"$nulls":25},"x"]
[{"$nulls":25},"x"]
[{"$nulls":25},"x"]
[{"$nulls":25},"x"]
[{"$nulls":25},"x"]
[{"$nulls":25},"x"]
[{"$nulls":25},"x"]
[{"$nulls":25},"x"]
[{"$nulls":25},"x"]
[{"$nulls":25},"x"]
[{"$nulls":25},"x"]
[{"$nulls":25},"x"]
[{"$nulls":25},"x"]
[{"$nulls":25},"x"]
[{"$nulls":25},"x"]
[{"$nulls":25},"x"]
[{"$nulls":25},"x"]
[{"$nulls":25},"x"]
[{"$nulls":25},"x"]
[{"$nulls":25},"x"]
[{"$nulls":25},"x"]
[{"$nulls":25},"x"]
[{"$nulls":25},"x"]
[{"$nulls":25},"x"]
[{"$nulls":25},"x"]
[{"$nulls":25},"x"]
[{"$nulls":25},"x"]
[{"$nulls":25},"x"]
[{"$nulls":25},"x"]
[{"$nulls":25},"x"]
[{"$nulls":25},"x"]
[{"$nulls":25},"x"]
[{"$nulls":25},"x"]
[{"$nulls":25},"x"]
[{"$nulls":25},"x"]
[{"$nulls":25},"x"]
[{"$nulls":25},"x"]
[{"$nulls":25},"x"]
[{"$nulls":25},"x"]
[{"$nulls":25},"x"]
[{"$nulls":25},"x"]
[{"$nulls":25},"x"]
[{"$nulls":25},"x"]
[{"$nulls":25},"x"]
[{"$nulls":25},"x"]
[{"$nulls":25},"x"]
[{"$nulls":25},"x"]
[{"$nulls":25},"x"]
[{"$nulls":25},"x"]
[{"$nulls":25},"x"]
[{"$nulls":25},"x"]
[{"$nulls":25},"x"]
[{"$nulls":25},"x"]
[{"$nulls":25},"x"]
[{"$nulls":25},"x"]
[{"$nulls":25},"x"]
[{"$nulls":25},"x"]
[{"$nulls":25},"x"]
[{"$nulls":25},"x"]
[{"$nulls":25},"x"]
[{"$nulls":25},"x"]
[{"$nulls":25},"x"]
[{"$nulls":25},"x"]
[{"$nulls":25},"x"]
[{"$nulls":25},"x"]
[{"$nulls":25},"x"]
[{"$nulls":25},"x"]
[{"$nulls":25},"x"]
[{"$nulls":25},"x"]
[{"$nulls":25},"x"]
[{"$nulls":25},"x"]
["x","x","x","x","x","x","x","x","x","x","x","x","x","x","x","x","x","x","x","x","x","x","x","x","x","x"]

{"sheet":"TOCSY","index":11,"n_rows":515,"n_cols":26,"rows_kept":515}
["1H-1H TOCSY NMR correlations",{"$nulls":24},"x"]
["peak index","ν (F2) [ppm]","ν (F1) [ppm]","intensity [rel]","annotation",{"$nulls":20},"x"]
[1,3.7915,1.4891,14896086,"2;3",{"$nulls":20},"x"]
[2,3.7915,3.7859,6191420,"2;2",{"$nulls":20},"x"]
[3,1.4861,1.4821,1689458,"3;3",{"$nulls":20},"x"]
[4,1.4869,3.7859,6801484,"3;2",{"$nulls":20},"x"]
{"$rows_empty":415}
[{"$nulls":25},"x"]
[{"$nulls":25},"x"]
[{"$nulls":25},"x"]
[{"$nulls":25},"x"]
[{"$nulls":25},"x"]
[{"$nulls":25},"x"]
[{"$nulls":25},"x"]
[{"$nulls":25},"x"]
[{"$nulls":25},"x"]
[{"$nulls":25},"x"]
[{"$nulls":25},"x"]
[{"$nulls":25},"x"]
[{"$nulls":25},"x"]
[{"$nulls":25},"x"]
[{"$nulls":25},"x"]
[{"$nulls":25},"x"]
[{"$nulls":25},"x"]
[{"$nulls":25},"x"]
[{"$nulls":25},"x"]
[{"$nulls":25},"x"]
[{"$nulls":25},"x"]
[{"$nulls":25},"x"]
[{"$nulls":25},"x"]
[{"$nulls":25},"x"]
[{"$nulls":25},"x"]
[{"$nulls":25},"x"]
[{"$nulls":25},"x"]
[{"$nulls":25},"x"]
[{"$nulls":25},"x"]
[{"$nulls":25},"x"]
[{"$nulls":25},"x"]
[{"$nulls":25},"x"]
[{"$nulls":25},"x"]
[{"$nulls":25},"x"]
[{"$nulls":25},"x"]
[{"$nulls":25},"x"]
[{"$nulls":25},"x"]
[{"$nulls":25},"x"]
[{"$nulls":25},"x"]
[{"$nulls":25},"x"]
[{"$nulls":25},"x"]
[{"$nulls":25},"x"]
[{"$nulls":25},"x"]
[{"$nulls":25},"x"]
[{"$nulls":25},"x"]
[{"$nulls":25},"x"]
[{"$nulls":25},"x"]
[{"$nulls":25},"x"]
[{"$nulls":25},"x"]
[{"$nulls":25},"x"]
[{"$nulls":25},"x"]
[{"$nulls":25},"x"]
[{"$nulls":25},"x"]
[{"$nulls":25},"x"]
[{"$nulls":25},"x"]
[{"$nulls":25},"x"]
[{"$nulls":25},"x"]
[{"$nulls":25},"x"]
[{"$nulls":25},"x"]
[{"$nulls":25},"x"]
[{"$nulls":25},"x"]
[{"$nulls":25},"x"]
[{"$nulls":25},"x"]
[{"$nulls":25},"x"]
[{"$nulls":25},"x"]
[{"$nulls":25},"x"]
[{"$nulls":25},"x"]
[{"$nulls":25},"x"]
[{"$nulls":25},"x"]
[{"$nulls":25},"x"]
[{"$nulls":25},"x"]
[{"$nulls":25},"x"]
[{"$nulls":25},"x"]
[{"$nulls":25},"x"]
[{"$nulls":25},"x"]
[{"$nulls":25},"x"]
[{"$nulls":25},"x"]
[{"$nulls":25},"x"]
[{"$nulls":25},"x"]
[{"$nulls":25},"x"]
[{"$nulls":25},"x"]
[{"$nulls":25},"x"]
[{"$nulls":25},"x"]
[{"$nulls":25},"x"]
[{"$nulls":25},"x"]
[{"$nulls":25},"x"]
[{"$nulls":25},"x"]
[{"$nulls":25},"x"]
[{"$nulls":25},"x"]
[{"$nulls":25},"x"]
[{"$nulls":25},"x"]
[{"$nulls":25},"x"]
[{"$nulls":25},"x"]
["x","x","x","x","x","x","x","x","x","x","x","x","x","x","x","x","x","x","x","x","x","x","x","x","x","x"]

{"sheet":"HSQC","index":12,"n_rows":204,"n_cols":26,"rows_kept":204}
["1H-13C HSQC NMR correlations",{"$nulls":24},"x"]
["peak index","ν (F2) (1H) [ppm]  ","ν (F1) (13C) [ppm]","intensity [rel]","annotation",{"$nulls":20},"x"]
[2,"0.8999","16.0523","2905649.75",{"$nulls":21},"x"]
[1,"0.9437","13.9434","4238211.50"]
[4,"0.9980","19.5009","187395.75"]
[3,"1.0160","17.4913","742931.25"]
[5,"1.0485","20.7414","403646.12"]
[8,"1.2692","27.2224","744979.25"]
[7,"1.3359","22.9187","660824.50"]
[6,"1.3393","22.2392","1368335.12"]
[13,"1.4557","19.4879","111020.25"]
[14,"1.4564","21.9300","612709.00"]
[10,"1.4740","25.4259","2246007.00"]
[11,"1.4777","27.1741","872664.62"]
[9,"1.4885","19.0464","603767.75"]
[12,"1.5628","22.1441","-97691.12"]
[15,"1.7248","29.0156","5007164.38"]
[16,"1.9227","30.3966","704344.38"]
[18,"1.9875","38.6313","988610.75"]
[17,"2.0085","26.4727","608914.12"]
[19,"2.0698","31.7230","502069.62"]
[20,"2.1459","29.0702","2639689.88"]
[21,"2.1643","42.3894","3416001.00"]
[22,"2.2798","31.7511","380077.62"]
[23,"2.3538","31.7511","462796.75"]
[25,"2.4433","45.7749","2285212.75"]
[24,"2.4585","33.6275","569698.38"]
[26,"2.6987","39.3423","96689.00"]
[27,"2.7207","37.3607","12450757.62"]
[28,"2.8183","39.3836","29221.62"]
[29,"2.8814","37.3194","216072.75"]
[30,"2.9607","37.4433","37676.88"]
[31,"3.0193","41.8605","9182155.25"]
[85,"3.1984","86.6795","328017.00"]
[36,"3.2001","56.6219","40271731.25"]
[32,"3.2075","30.1753","254470.00"]
[37,"3.2252","56.9672","28674533.50"]
[33,"3.2391","43.2260","2320787.38"]
[43,"3.2584","76.8257","2025205.75"]
[86,"3.2627","86.2067","361895.75"]
[38,"3.2650","56.0695","38114864.50"]
[35,"3.2936","30.1063","209911.00"]
[34,"3.3187","29.2777","388119.50"]
[39,"3.3476","48.6810","429531.75"]
[51,"3.3952","72.2988","711826.62"]
[50,"3.4111","72.2988","1911800.88"]
[40,"3.4177","48.8192","585514.25"]
[53,"3.4292","78.5021","373509.25"]
[49,"3.4333","72.6608","802730.88"]
[52,"3.4626","72.4994","313047.25"]
[48,"3.4653","78.6027","708881.12"]
[41,"3.4869","29.2086","166038.75"]
[47,"3.5022","78.3614","2073261.75"]
[46,"3.5028","74.5912","1490959.00"]
[44,"3.5185","70.0970","2522104.62"]
[45,"3.5459","74.1991","135351.62"]
[42,"3.5682","44.2618","9186934.12"]
[54,"3.6110","63.1224","856602.00"]
[55,"3.6572","75.3213","112987.62"]
[56,"3.6809","62.1294","2858919.50"]
[57,"3.7093","77.9455","1186027.62"]
[58,"3.7241","75.4631","1243088.25"]
[59,"3.7503","63.5479","1521356.88"]
[70,"3.7591","77.8815","352110.88"]
[60,"3.7817","56.8101","3530675.25"]
[61,"3.7923","53.0511","25922.88"]
[67,"3.8160","71.1259","-64699.75"]
[69,"3.8378","74.1678","596235.12"]
[66,"3.8447","63.4318","79605.62"]
[68,"3.8646","71.9311","-46418.00"]
[63,"3.9004","63.4318","40225.88"]
[64,"3.9018","68.8893","7433751.75"]
[62,"3.9055","54.6641","646634.62"]
[65,"3.9392","71.3943","2207874.62"]
[71,"3.9642","46.5918","11505361.62"]
[75,"3.9963","72.0940","1246065.50"]
[73,"4.0122","57.1690","2451512.62"]
[72,"4.0133","53.9245","1897452.00"]
[74,"4.0644","57.9477","2766938.88"]
[76,"4.0908","73.2689","736620.50"]
[77,"4.1184","71.3501","14683.12"]
[78,"4.1396","63.9272","1883670.88"]
[79,"4.2616","68.6541","1734548.12"]
[80,"4.5665","66.8184","620649.12"]
[81,"4.5941","99.2849","152868.00"]
[82,"4.6552","98.7626","7296.50"]
[83,"5.2436","94.7737","1283943.88"]
[84,"5.2767","94.9811","940202.12"]
[87,"6.5273","138.0556","3123321.12"]
[88,"7.1564","119.8806","2730957.00"]
[89,"7.2027","122.1636","2033592.25"]
[90,"7.2871","124.8524","1442324.25"]
[91,"7.3337","127.8202","3195195.12"]
[92,"7.5478","114.6530","137736.25"]
[93,"7.5552","131.5389","2601058.00"]
[94,"7.6422","134.9651","1013555.00"]
[95,"7.7377","121.2605","87099.38"]
[96,"7.8353","129.9482","901597.88"]
[97,"8.0481","138.2658","1459834.62"]
{"$rows_empty":9}
[{"$nulls":25},"x"]
[{"$nulls":25},"x"]
[{"$nulls":25},"x"]
[{"$nulls":25},"x"]
[{"$nulls":25},"x"]
[{"$nulls":25},"x"]
[{"$nulls":25},"x"]
[{"$nulls":25},"x"]
[{"$nulls":25},"x"]
[{"$nulls":25},"x"]
[{"$nulls":25},"x"]
[{"$nulls":25},"x"]
[{"$nulls":25},"x"]
[{"$nulls":25},"x"]
[{"$nulls":25},"x"]
[{"$nulls":25},"x"]
[{"$nulls":25},"x"]
[{"$nulls":25},"x"]
[{"$nulls":25},"x"]
[{"$nulls":25},"x"]
[{"$nulls":25},"x"]
[{"$nulls":25},"x"]
[{"$nulls":25},"x"]
[{"$nulls":25},"x"]
[{"$nulls":25},"x"]
[{"$nulls":25},"x"]
[{"$nulls":25},"x"]
[{"$nulls":25},"x"]
[{"$nulls":25},"x"]
[{"$nulls":25},"x"]
[{"$nulls":25},"x"]
[{"$nulls":25},"x"]
[{"$nulls":25},"x"]
[{"$nulls":25},"x"]
[{"$nulls":25},"x"]
[{"$nulls":25},"x"]
[{"$nulls":25},"x"]
[{"$nulls":25},"x"]
[{"$nulls":25},"x"]
[{"$nulls":25},"x"]
[{"$nulls":25},"x"]
[{"$nulls":25},"x"]
[{"$nulls":25},"x"]
[{"$nulls":25},"x"]
[{"$nulls":25},"x"]
[{"$nulls":25},"x"]
[{"$nulls":25},"x"]
[{"$nulls":25},"x"]
[{"$nulls":25},"x"]
[{"$nulls":25},"x"]
[{"$nulls":25},"x"]
[{"$nulls":25},"x"]
[{"$nulls":25},"x"]
[{"$nulls":25},"x"]
[{"$nulls":25},"x"]
[{"$nulls":25},"x"]
[{"$nulls":25},"x"]
[{"$nulls":25},"x"]
[{"$nulls":25},"x"]
[{"$nulls":25},"x"]
[{"$nulls":25},"x"]
[{"$nulls":25},"x"]
[{"$nulls":25},"x"]
[{"$nulls":25},"x"]
[{"$nulls":25},"x"]
[{"$nulls":25},"x"]
[{"$nulls":25},"x"]
[{"$nulls":25},"x"]
[{"$nulls":25},"x"]
[{"$nulls":25},"x"]
[{"$nulls":25},"x"]
[{"$nulls":25},"x"]
[{"$nulls":25},"x"]
[{"$nulls":25},"x"]
[{"$nulls":25},"x"]
[{"$nulls":25},"x"]
[{"$nulls":25},"x"]
[{"$nulls":25},"x"]
[{"$nulls":25},"x"]
[{"$nulls":25},"x"]
[{"$nulls":25},"x"]
[{"$nulls":25},"x"]
[{"$nulls":25},"x"]
[{"$nulls":25},"x"]
[{"$nulls":25},"x"]
[{"$nulls":25},"x"]
[{"$nulls":25},"x"]
[{"$nulls":25},"x"]
[{"$nulls":25},"x"]
[{"$nulls":25},"x"]
[{"$nulls":25},"x"]
[{"$nulls":25},"x"]
[{"$nulls":25},"x"]
[{"$nulls":25},"x"]
[{"$nulls":25},"x"]
["x","x","x","x","x","x","x","x","x","x","x","x","x","x","x","x","x","x","x","x","x","x","x","x","x","x"]

{"sheet":"HMBC","index":13,"n_rows":582,"n_cols":26,"rows_kept":582}
["1H-13C HMBC NMR correlations",{"$nulls":24},"x"]
["peak index","ν (F2) (1H) [ppm]  ","ν (F1) (13C) [ppm]","intensity [rel]","annotation",{"$nulls":20},"x"]
[2,"0.7939","16.0692","556228.62",{"$nulls":21},"x"]
[1,"0.8345","13.7835","571653.00",{"$nulls":21},"x"]
[4,"0.8885","19.1861","262295.12",{"$nulls":21},"x"]
[5,"0.8895","22.0952","248995.25"]
[6,"0.8989","42.2510","2611817.00"]
[3,"0.9068","17.5238","575773.62"]
[7,"0.9434","38.7186","4903522.25"]
[8,"0.9449","26.9437","4454064.50"]
[10,"0.9989","31.5844","2381685.50"]
[9,"1.0013","20.5714","3052196.38"]
[21,"1.0102","62.4167","5083706.62"]
[11,"1.0142","38.5800","3398182.62"]
[12,"1.0157","27.0822","1970468.75"]
[18,"1.0464","13.9913","570308.25"]
[20,"1.0473","63.1400","3940345.12"]
[13,"1.0479","31.7922","3173971.88"]
[14,"1.0489","19.3939","2597215.00"]
[15,"1.0984","19.2554","382643.75"]
[16,"1.1221","17.5238","709772.50"]
[17,"1.1513","20.7792","482747.62"]
[19,"1.2305","22.3030","632528.12"]
[36,"1.3364","185.2534","1344047.62"]
[24,"1.3366","71.3828","1555729.38"]
[23,"1.3377","68.8781","6851843.25"]
[22,"1.3397","63.1731","6681849.75"]
[25,"1.4392","21.9853","449047.12"]
[29,"1.4558","69.2956","432362.88"]
[30,"1.4579","75.5572","625194.75"]
[38,"1.4583","181.3213","693744.00"]
[27,"1.4724","41.7443","1151538.00"]
[26,"1.4734","28.9427","961452.12"]
[28,"1.4848","53.1544","3383894.00"]
[37,"1.4884","178.7183","3364582.38"]
[39,"1.5620","186.7488","58529.38"]
[31,"1.5636","16.0020","134475.00"]
[32,"1.5636","42.4401","73453.25"]
[35,"1.7252","41.8835","1003516.88"]
[34,"1.7262","28.8036","603565.75"]
[33,"1.7273","25.0466","829319.75"]
[47,"2.0067","63.5981","47779.12"]
[46,"2.0079","31.6655","22831.38"]
[45,"2.0681","48.7675","440941.00"]
[44,"2.0716","26.3211","566482.25"]
[65,"2.0789","177.5172","388722.50"]
[43,"2.1457","56.9177","383440.88"]
[63,"2.1465","176.8344","162930.88"]
[64,"2.1486","180.5213","177643.75"]
[42,"2.1492","33.2688","186487.00"]
[62,"2.1640","186.8027","1737761.50"]
[40,"2.1654","15.8995","1672927.38"]
[41,"2.1654","22.1792","2139037.50"]
[51,"2.4389","72.6836","374556.38"]
[50,"2.4423","66.6712","149925.75"]
[66,"2.4557","180.4530","296489.00"]
[48,"2.4586","29.1269","757366.00"]
[49,"2.4597","56.6504","598853.75"]
[52,"2.6022","37.0098","852145.88"]
[54,"2.7007","54.6463","781147.38"]
[67,"2.7045","176.9738","409874.75"]
[68,"2.7066","180.2690","732837.62"]
[53,"2.7204","37.1435","12228017.88"]
[57,"2.8007","54.7656","710574.62"]
[69,"2.8172","177.1676","616146.75"]
[70,"2.8172","180.4144","136828.12"]
[56,"2.8300","54.6762","1391819.50"]
[55,"2.8383","37.3442","1149489.62"]
[58,"2.8789","53.9615","1496292.62"]
[71,"2.8856","177.3615","1034750.00"]
[59,"2.9580","54.1402","629309.50"]
[72,"2.9598","176.1985","402565.00"]
[73,"2.9609","177.2646","666682.50"]
[60,"3.0239","25.5513","370803.38"]
[61,"3.0244","29.2143","296794.88"]
[76,"3.0761","56.6006","2486654.00"]
[77,"3.1088","57.0852","1174439.38"]
[78,"3.1466","55.8253","1215302.50"]
[149,"3.1866","176.2911","553286.50"]
[112,"3.1999","70.1744","16977642.00"]
[79,"3.2017","56.6006","41583952.12"]
[134,"3.2125","119.8506","295185.88"]
[135,"3.2137","133.4547","235190.25"]
[148,"3.2162","176.4191","240007.00"]
[113,"3.2248","73.0778","16963085.38"]
[80,"3.2293","56.6975","34092577.62"]
[147,"3.2372","159.4680","821295.00"]
[75,"3.2379","30.4325","832964.25"]
[74,"3.2430","26.3619","585504.00"]
[140,"3.2633","98.6779","218373.50"]
[114,"3.2636","68.9693","24581520.88"]
[81,"3.2671","56.1160","45945910.50"]
[150,"3.2917","176.3551","1024360.88"]
[138,"3.2957","119.8506","1488327.12"]
[136,"3.3014","133.4547","1611794.25"]
[82,"3.3136","57.1821","2203648.62"]
[137,"3.3199","128.6645","431977.50"]
[151,"3.3226","177.3785","244618.00"]
[139,"3.3234","109.6954","213453.12"]
[84,"3.3446","31.5955","84720.00"]
[85,"3.3463","26.1681","52820.00"]
[83,"3.3480","57.0852","2073518.62"]
[88,"3.3808","56.0191","2079482.50"]
[115,"3.4062","63.5459","364072.25"]
[117,"3.4137","78.6655","1043904.00"]
[86,"3.4152","26.6527","183621.38"]
[87,"3.4169","31.4986","249164.25"]
[89,"3.4272","56.6975","3448974.75"]
[116,"3.4299","67.0519","723928.25"]
[90,"3.4496","44.0012","540791.88"]
[91,"3.4703","57.9575","2107733.12"]
[142,"3.4850","110.1744","1300907.50"]
[152,"3.4870","177.3785","1292353.88"]
[143,"3.4884","128.7603","504490.88"]
[119,"3.5012","72.3657","690375.88"]
[141,"3.5034","99.0612","145713.50"]
[118,"3.5045","76.8029","1212771.00"]
[92,"3.5167","56.6006","3230281.62"]
[93,"3.5185","58.4421","1138843.62"]
[120,"3.5487","75.6525","585997.00"]
[153,"3.5692","175.3185","7786046.88"]
[98,"3.6028","21.9037","348288.75"]
[154,"3.6030","175.6624","2970807.75"]
[121,"3.6038","68.6406","1991904.38"]
[155,"3.6225","177.0952","2505628.75"]
[94,"3.6235","19.6745","1674623.62"]
[97,"3.6235","31.5955","1168360.88"]
[123,"3.6578","74.7213","569372.25"]
[95,"3.6785","17.3485","2137923.00"]
[96,"3.6803","27.0404","1941263.00"]
[99,"3.6803","38.8645","2604122.88"]
[156,"3.6808","177.0952","2597170.75"]
[100,"3.6854","44.3888","372234.38"]
[122,"3.7107","63.6555","1110102.25"]
[144,"3.7112","99.1570","286774.75"]
[125,"3.7161","72.2561","593802.25"]
[127,"3.7302","74.1735","391266.75"]
[126,"3.7442","72.2013","384195.50"]
[124,"3.7485","78.3368","434889.00"]
[102,"3.7818","26.9434","309951.00"]
[103,"3.7836","29.0757","1373400.00"]
[104,"3.7836","30.5294","432747.38"]
[105,"3.7853","33.2432","1168017.88"]
[157,"3.7854","176.7513","1157143.12"]
[101,"3.7922","18.6084","123659.38"]
[128,"3.8274","71.9274","179277.50"]
[200,"3.8460","46.5210","314598.75"]
[107,"3.8989","56.4068","11378286.00"]
[159,"3.9020","177.2098","528289.38"]
[158,"3.9027","171.9371","5860157.50"]
[106,"3.9075","39.2521","909726.12"]
[160,"3.9089","180.1328","654285.12"]
[129,"3.9364","75.2691","906888.62"]
[162,"3.9641","173.0834","7310321.62"]
[161,"3.9685","179.4450","3288895.00"]
[130,"4.0023","71.7631","346047.88"]
[108,"4.0108","37.3138","236582.12"]
[109,"4.0108","30.0448","521453.62"]
[146,"4.0125","133.3589","759285.75"]
[163,"4.0142","176.4075","838358.38"]
[132,"4.0239","68.8049","190829.75"]
[110,"4.0624","29.1726","586344.00"]
[164,"4.0663","177.4964","672295.25"]
[145,"4.0668","110.1744","697908.00"]
[131,"4.0671","70.1744","353292.62"]
[201,"4.0808","46.3272","263979.75"]
[133,"4.0952","63.7651","348074.88"]
[165,"4.1415","177.3818","189976.25"]
[111,"4.1450","31.5955","124066.00"]
[168,"4.5196","98.4003","81519.12"]
[166,"4.5664","45.3788","179813.88"]
[167,"4.5700","72.9245","293008.88"]
[169,"4.7893","98.5595","335398.62"]
[170,"5.2477","74.9944","557162.75"]
[171,"5.2783","71.8099","467144.88"]
[172,"6.5252","137.9017","506668.25"]
[173,"6.5273","177.4446","5861881.50"]
[175,"6.9931","120.2342","272834.62"]
[178,"7.1570","138.1048","722239.12"]
[176,"7.2048","114.5909","281921.38"]
[177,"7.2060","129.3262","184647.25"]
[179,"7.2861","121.4883","207928.38"]
[180,"7.2861","138.8886","140067.88"]
[174,"7.3332","29.2335","428732.25"]
[181,"7.3338","110.0449","1456669.88"]
[182,"7.3351","129.0127","511083.12"]
[183,"7.3364","139.2021","1145493.62"]
[184,"7.5507","121.9586","189453.88"]
[185,"7.5507","129.4830","459750.12"]
[186,"7.5507","131.6776","337847.75"]
[187,"7.5545","136.2236","552284.12"]
[188,"7.6436","130.1100","485377.62"]
[190,"7.7352","125.0938","352820.12"]
[189,"7.7378","110.3584","414581.75"]
[191,"7.7391","129.1695","266690.62"]
[192,"7.7391","139.3588","345696.75"]
[193,"7.8346","129.6398","284730.25"]
[196,"7.8346","173.3755","385027.88"]
[194,"7.8372","134.6561","261564.25"]
[195,"7.8785","138.2615","1131040.50"]
[198,"8.0553","133.4020","1195287.75"]
[197,"8.0566","119.9207","2353143.25"]
[199,"8.2296","138.4183","1311425.88"]
{"$rows_empty":285}
[{"$nulls":25},"x"]
[{"$nulls":25},"x"]
[{"$nulls":25},"x"]
[{"$nulls":25},"x"]
[{"$nulls":25},"x"]
[{"$nulls":25},"x"]
[{"$nulls":25},"x"]
[{"$nulls":25},"x"]
[{"$nulls":25},"x"]
[{"$nulls":25},"x"]
[{"$nulls":25},"x"]
[{"$nulls":25},"x"]
[{"$nulls":25},"x"]
[{"$nulls":25},"x"]
[{"$nulls":25},"x"]
[{"$nulls":25},"x"]
[{"$nulls":25},"x"]
[{"$nulls":25},"x"]
[{"$nulls":25},"x"]
[{"$nulls":25},"x"]
[{"$nulls":25},"x"]
[{"$nulls":25},"x"]
[{"$nulls":25},"x"]
[{"$nulls":25},"x"]
[{"$nulls":25},"x"]
[{"$nulls":25},"x"]
[{"$nulls":25},"x"]
[{"$nulls":25},"x"]
[{"$nulls":25},"x"]
[{"$nulls":25},"x"]
[{"$nulls":25},"x"]
[{"$nulls":25},"x"]
[{"$nulls":25},"x"]
[{"$nulls":25},"x"]
[{"$nulls":25},"x"]
[{"$nulls":25},"x"]
[{"$nulls":25},"x"]
[{"$nulls":25},"x"]
[{"$nulls":25},"x"]
[{"$nulls":25},"x"]
[{"$nulls":25},"x"]
[{"$nulls":25},"x"]
[{"$nulls":25},"x"]
[{"$nulls":25},"x"]
[{"$nulls":25},"x"]
[{"$nulls":25},"x"]
[{"$nulls":25},"x"]
[{"$nulls":25},"x"]
[{"$nulls":25},"x"]
[{"$nulls":25},"x"]
[{"$nulls":25},"x"]
[{"$nulls":25},"x"]
[{"$nulls":25},"x"]
[{"$nulls":25},"x"]
[{"$nulls":25},"x"]
[{"$nulls":25},"x"]
[{"$nulls":25},"x"]
[{"$nulls":25},"x"]
[{"$nulls":25},"x"]
[{"$nulls":25},"x"]
[{"$nulls":25},"x"]
[{"$nulls":25},"x"]
[{"$nulls":25},"x"]
[{"$nulls":25},"x"]
[{"$nulls":25},"x"]
[{"$nulls":25},"x"]
[{"$nulls":25},"x"]
[{"$nulls":25},"x"]
[{"$nulls":25},"x"]
[{"$nulls":25},"x"]
[{"$nulls":25},"x"]
[{"$nulls":25},"x"]
[{"$nulls":25},"x"]
[{"$nulls":25},"x"]
[{"$nulls":25},"x"]
[{"$nulls":25},"x"]
[{"$nulls":25},"x"]
[{"$nulls":25},"x"]
[{"$nulls":25},"x"]
[{"$nulls":25},"x"]
[{"$nulls":25},"x"]
[{"$nulls":25},"x"]
[{"$nulls":25},"x"]
[{"$nulls":25},"x"]
[{"$nulls":25},"x"]
[{"$nulls":25},"x"]
[{"$nulls":25},"x"]
[{"$nulls":25},"x"]
[{"$nulls":25},"x"]
[{"$nulls":25},"x"]
[{"$nulls":25},"x"]
[{"$nulls":25},"x"]
[{"$nulls":25},"x"]
["x","x","x","x","x","x","x","x","x","x","x","x","x","x","x","x","x","x","x","x","x","x","x","x","x","x"]

{"sheet":"carbon-13-1D_acquisition","index":14,"n_rows":348,"n_cols":26,"rows_kept":348}
["carbon",{"$nulls":24},"x"]
["peak index","region","index (F1)","ν (F1) [ppm]","ν (F1) [Hz]","intensity [abs]","intensity [rel]","half width [ppm]","half width [Hz]","annotation",{"$nulls":15},"x"]
[1,1,"9707.1","186.9264","28207.6385","556043.15","2.01","0.0109","1.6506",{"$nulls":16},"x"]
[2,2,"10136.5","185.3609","27971.4008","355065.70","1.24","0.0073","1.1004",{"$nulls":16},"x"]
[3,3,"11346.6","180.9487","27305.5893","559790.98","1.96","0.0073","1.1004"]
[4,3,"11475.3","180.4794","27234.7708","569243.26","2.00","0.0146","2.2008"]
[5,3,"11488.8","180.4303","27227.3615","999648.83","3.59","0.0036","0.5502"]
[6,4,"11689.7","179.6977","27116.8104","755855.17","2.66","0.0073","1.1004"]
[7,4,"11950.9","178.7453","26973.0910","589203.11","2.14","0.0073","1.1004"]
[8,5,"12257.1","177.6288","26804.6085","653703.00","2.37","0.0073","1.1004"]
[9,5,"12297.4","177.4820","26782.4560","1684376.26","5.91","0.0036","0.5502"]
[10,5,"12320.0","177.3996","26770.0217","1038972.02","3.79","0.0109","1.6506"]
[11,5,"12351.1","177.2863","26752.9244","425439.56","1.52","0.0109","1.6506"]
[12,5,"12384.0","177.1663","26734.8162","600464.22","2.18","0.0109","1.6506"]
[13,5,"12391.0","177.1408","26730.9681","775790.97","2.85","0.0073","1.1004"]
[14,5,"12411.4","177.0663","26719.7259","788761.63","2.76","0.0109","1.6506"]
[15,5,"12442.8","176.9518","26702.4476","891217.09","3.20","0.0073","1.1004"]
[16,6,"12568.2","176.4946","26633.4550","812221.19","2.89","0.0073","1.1004"]
[17,6,"12624.4","176.2899","26602.5653","792513.98","2.78","0.0073","1.1004"]
[18,7,"12769.9","175.7594","26522.5116","657937.07","2.37","0.0073","1.1004"]
[19,7,"12873.6","175.3811","26465.4252","760986.31","2.67","0.0073","1.1004"]
[20,8,"13429.6","173.3538","26159.5008","536900.48","1.88","0.0109","1.6506"]
[21,8,"13771.7","172.1067","25971.3105","624645.62","2.20","0.0073","1.1004"]
[22,9,"17185.3","159.6606","24093.1644","107993.51","0.38","0.0109","1.6506"]
[23,10,"22808.7","139.1573","20999.1676","607842.95","2.15","0.0073","1.1004"]
[24,10,"23010.7","138.4210","20888.0582","696595.30","2.44","0.0255","3.8514"]
[25,11,"23076.9","138.1795","20851.6153","3935705.70","14.48","0.0036","0.5502"]
[26,12,"23610.9","136.2325","20557.8084","568090.73","2.05","0.0109","1.6506"]
[27,13,"23939.6","135.0339","20376.9368","1569827.02","5.51","0.0073","1.1004"]
[28,14,"24375.7","133.4440","20137.0171","296783.33","1.04","0.0401","6.0522"]
[29,15,"24872.7","131.6318","19863.5518","3625507.94","12.90","0.0036","0.5502"]
[30,16,"25326.7","129.9766","19613.7782","3747452.70","13.29","0.0036","0.5502"]
[31,17,"25457.8","129.4985","19541.6317","627162.44","2.24","0.0109","1.6506"]
[32,18,"25887.8","127.9309","19305.0772","1263901.17","4.49","0.0109","1.6506"]
[33,19,"26708.0","124.9404","18853.8036","1443719.41","5.33","0.0109","1.6506"]
[34,20,"27440.5","122.2694","18450.7433","1544891.66","5.40","0.0073","1.1004"]
[35,20,"27705.1","121.3050","18305.2131","1436097.88","5.22","0.0073","1.1004"]
[36,21,"28061.5","120.0052","18109.0702","1536164.05","5.37","0.0073","1.1004"]
[37,22,"29486.7","114.8091","17324.9663","1386161.73","4.89","0.0073","1.1004"]
[38,23,"30718.4","110.3183","16647.2939","650520.05","2.28","0.0146","2.2008"]
[39,24,"33744.7","99.2841","14982.2069","1147570.16","4.06","0.0073","1.1004"]
[40,24,"33893.8","98.7407","14900.2065","1266768.47","4.51","0.0073","1.1004"]
[41,25,"34888.6","95.1133","14352.8232","534046.66","1.88","0.0073","1.1004"]
[42,25,"34941.7","94.9199","14323.6387","736226.36","2.60","0.0073","1.1004"]
[43,26,"39368.2","78.7806","11888.1800","1187011.29","4.25","0.0073","1.1004"]
[44,26,"39426.5","78.5682","11856.1283","1144465.77","4.00","0.0073","1.1004"]
[45,26,"39588.6","77.9770","11766.9148","1220273.16","4.28","0.0073","1.1004"]
[46,27,"39865.1","76.9691","11614.8203","1045207.23","3.80","0.0073","1.1004"]
[47,28,"40235.9","75.6171","11410.8003","985233.28","3.57","0.0109","1.6506"]
[48,28,"40248.0","75.5730","11404.1455","630789.36","2.32","0.0109","1.6506"]
[49,29,"40484.7","74.7100","11273.9167","1004919.59","3.53","0.0073","1.1004"]
[50,29,"40599.4","74.2918","11210.8094","801560.26","2.81","0.0109","1.6506"]
[51,30,"40868.0","73.3125","11063.0307","454856.87","1.70","0.0036","0.5502"]
[52,30,"40964.4","72.9608","11009.9583","253554.77","0.89","0.0219","3.3012"]
[53,31,"41101.7","72.4603","10934.4317","554104.67","1.95","0.0109","1.6506"]
[54,31,"41111.8","72.4234","10928.8634","1050202.59","3.75","0.0109","1.6506"]
[55,31,"41192.4","72.1296","10884.5282","465594.37","1.63","0.0073","1.1004"]
[56,31,"41230.8","71.9894","10863.3717","447447.53","1.62","0.0036","0.5502"]
[57,31,"41344.6","71.5747","10800.7925","1017847.96","3.56","0.0073","1.1004"]
[58,31,"41413.4","71.3239","10762.9462","849200.29","2.98","0.0073","1.1004"]
[59,31,"41456.5","71.1666","10739.2092","452483.45","1.58","0.0073","1.1004"]
[60,32,"41704.7","70.2617","10602.6577","492115.11","1.74","0.0073","1.1004"]
[61,32,"41710.2","70.2415","10599.6095","531315.23","1.89","0.0073","1.1004"]
[62,32,"41715.7","70.2217","10596.6216","527896.17","1.86","0.0073","1.1004"]
[63,33,"41919.3","69.4792","10484.5766","117258.73","0.42","0.0036","0.5502"]
[64,34,"42041.0","69.0355","10417.6212","395374.23","1.41","0.0255","3.8514"]
[65,35,"42115.2","68.7651","10376.8172","1740480.80","6.27","0.0073","1.1004"]
[66,36,"42625.4","66.9046","10096.0633","923838.36","3.23","0.0073","1.1004"]
[67,37,"43420.0","64.0076","9658.8991","1500308.77","5.39","0.0146","2.2008"]
[68,37,"43477.3","63.7986","9627.3605","966637.49","3.41","0.0073","1.1004"]
[69,37,"43543.2","63.5586","9591.1439","817913.61","2.91","0.0109","1.6506"]
[70,37,"43584.8","63.4066","9568.2068","443878.62","1.59","0.0109","1.6506"]
[71,37,"43632.5","63.2330","9542.0101","1480675.73","5.18","0.0073","1.1004"]
[72,37,"43648.6","63.1743","9533.1522","1425578.48","4.98","0.0073","1.1004"]
[73,38,"43875.3","62.3477","9408.4163","1629000.37","5.77","0.0073","1.1004"]
[74,39,"44952.5","58.4200","8815.7170","1569989.33","5.48","0.0073","1.1004"]
[75,39,"45110.1","57.8455","8729.0236","1316215.56","4.73","0.0109","1.6506"]
[76,40,"45261.6","57.2929","8645.6349","1196115.64","4.19","0.0109","1.6506"]
[77,40,"45317.4","57.0897","8614.9715","527696.95","1.85","0.0073","1.1004"]
[78,40,"45349.3","56.9734","8597.4216","731859.83","2.57","0.0182","2.7510"]
[79,40,"45356.5","56.9469","8593.4227","2498718.99","8.73","0.0109","1.6506"]
[80,40,"45362.9","56.9237","8589.9218","854615.73","3.03","0.0146","2.2008"]
[81,40,"45411.7","56.7458","8563.0762","1617063.27","5.71","0.0073","1.1004"]
[82,40,"45418.9","56.7196","8559.1226","1687384.14","6.11","0.0109","1.6506"]
[83,40,"45426.1","56.6932","8555.1388","1624747.22","5.85","0.0073","1.1004"]
[84,40,"45548.9","56.2456","8487.5949","1113015.30","3.97","0.0146","2.2008"]
[85,40,"45555.9","56.2199","8483.7167","1412411.13","5.06","0.0146","2.2008"]
[86,40,"45563.0","56.1942","8479.8385","1208900.27","4.35","0.0146","2.2008"]
[87,41,"45888.7","55.0068","8300.6570","1397742.91","4.90","0.0109","1.6506"]
[88,41,"46142.5","54.0812","8160.9817","1368694.02","4.78","0.0109","1.6506"]
[89,41,"46349.1","53.3279","8047.3070","1262243.68","4.52","0.0109","1.6506"]
[90,42,"47562.9","48.9024","7379.4885","1601990.93","5.82","0.0109","1.6506"]
[91,43,"48185.5","46.6324","7036.9401","1502975.75","5.25","0.0073","1.1004"]
[92,43,"48411.9","45.8069","6912.3702","496314.66","1.75","0.0255","3.8514"]
[93,44,"48829.5","44.2844","6682.6213","1509983.81","5.27","0.0109","1.6506"]
[94,44,"49097.4","43.3076","6535.2199","453334.09","1.59","0.0146","2.2008"]
[95,45,"49339.2","42.4260","6402.1843","1947987.49","7.00","0.0036","0.5502"]
[96,45,"49469.5","41.9509","6330.4906","3043581.98","10.63","0.0073","1.1004"]
[97,46,"50170.1","39.3963","5944.9954","1893151.73","6.84","0.0073","1.1004"]
[98,46,"50359.7","38.7053","5840.7219","2248351.10","7.93","0.0036","0.5502"]
[99,47,"50715.0","37.4098","5645.2278","1117061.52","4.00","0.0182","2.7510"]
[100,47,"50728.6","37.3601","5637.7280","2167990.96","7.59","0.0109","1.6506"]
[101,48,"51738.6","33.6778","5082.0601","1285891.24","4.49","0.0146","2.2008"]
[102,49,"52224.1","31.9074","4814.9026","1892929.09","6.87","0.0036","0.5502"]
[103,49,"52243.0","31.8387","4804.5356","2118416.06","7.89","0.0036","0.5502"]
[104,50,"52637.6","30.3999","4587.4172","756432.39","2.65","0.0073","1.1004"]
[105,50,"52689.5","30.2105","4558.8363","998944.09","3.49","0.0255","3.8514"]
[106,51,"52957.2","29.2344","4411.5405","1663440.88","5.91","0.0073","1.1004"]
[107,51,"52997.4","29.0881","4389.4635","2022695.12","7.10","0.0073","1.1004"]
[108,51,"53004.4","29.0625","4385.6004","4276514.05","15.00","0.0073","1.1004"]
[109,52,"53486.6","27.3045","4120.3140","2264506.25","7.92","0.0073","1.1004"]
[110,52,"53660.2","26.6713","4024.7626","671806.09","2.38","0.0109","1.6506"]
[111,52,"53681.9","26.5922","4012.8262","2174768.33","8.01","0.0036","0.5502"]
[112,52,"53990.7","25.4663","3842.9253","1961493.15","6.96","0.0073","1.1004"]
[113,53,"54682.4","22.9443","3462.3495","1104409.22","3.86","0.0073","1.1004"]
[114,53,"54862.5","22.2878","3363.2820","1955796.09","6.83","0.0073","1.1004"]
[115,53,"54893.4","22.1750","3346.2603","2246274.07","7.86","0.0073","1.1004"]
[116,54,"55274.5","20.7855","3136.5814","2071240.83","7.23","0.0073","1.1004"]
[117,54,"55619.6","19.5274","2946.7311","1976485.65","6.92","0.0073","1.1004"]
[118,54,"55757.2","19.0256","2871.0083","1950726.20","6.98","0.0073","1.1004"]
[119,55,"56170.5","17.5189","2643.6437","2355281.55","8.23","0.0073","1.1004"]
[120,55,"56562.4","16.0900","2428.0193","2104859.93","7.40","0.0073","1.1004"]
[121,55,"57148.0","13.9547","2105.7974","2183108.25","8.19","0.0036","0.5502"]
{"$rows_empty":130}
[{"$nulls":25},"x"]
[{"$nulls":25},"x"]
[{"$nulls":25},"x"]
[{"$nulls":25},"x"]
[{"$nulls":10},"|=> you can insert new rows here",{"$nulls":14},"x"]
[{"$nulls":25},"x"]
["multiplet","(if C-H and/or C-C coupling)",null,"use \",\" as separator","[ppm1 .. ppm2]",{"$nulls":20},"x"]
["ν (F1) [ppm]","C's","type","J(Hz)","range (ppm)","atoms","MSI level",{"$nulls":18},"x"]
[{"$nulls":7},"|=> leave unused rows empty",{"$nulls":17},"x"]
[{"$nulls":7},"|=> MSI level: used for biomatrix (later)",{"$nulls":17},"x"]
[{"$nulls":7},"NOTE:  if completed, image of the molecule with atom number attribution",{"$nulls":17},"x"]
[{"$nulls":25},"x"]
[{"$nulls":25},"x"]
[{"$nulls":25},"x"]
[{"$nulls":25},"x"]
[{"$nulls":25},"x"]
[{"$nulls":25},"x"]
[{"$nulls":7},"|=> you can insert new rows here",{"$nulls":17},"x"]
[{"$nulls":25},"x"]
[{"$nulls":25},"x"]
[{"$nulls":25},"x"]
[{"$nulls":25},"x"]
[{"$nulls":25},"x"]
[{"$nulls":25},"x"]
[{"$nulls":25},"x"]
[{"$nulls":25},"x"]
[{"$nulls":25},"x"]
[{"$nulls":25},"x"]
[{"$nulls":25},"x"]
[{"$nulls":25},"x"]
[{"$nulls":25},"x"]
[{"$nulls":25},"x"]
[{"$nulls":25},"x"]
[{"$nulls":25},"x"]
[{"$nulls":25},"x"]
[{"$nulls":25},"x"]
[{"$nulls":25},"x"]
[{"$nulls":25},"x"]
[{"$nulls":25},"x"]
[{"$nulls":25},"x"]
[{"$nulls":25},"x"]
[{"$nulls":25},"x"]
[{"$nulls":25},"x"]
[{"$nulls":25},"x"]
[{"$nulls":25},"x"]
[{"$nulls":25},"x"]
[{"$nulls":25},"x"]
[{"$nulls":25},"x"]
[{"$nulls":25},"x"]
[{"$nulls":25},"x"]
[{"$nulls":25},"x"]
[{"$nulls":25},"x"]
[{"$nulls":25},"x"]
[{"$nulls":25},"x"]
[{"$nulls":25},"x"]
[{"$nulls":25},"x"]
[{"$nulls":25},"x"]
[{"$nulls":25},"x"]
[{"$nulls":25},"x"]
[{"$nulls":25},"x"]
[{"$nulls":25},"x"]
[{"$nulls":25},"x"]
[{"$nulls":25},"x"]
[{"$nulls":25},"x"]
[{"$nulls":25},"x"]
[{"$nulls":25},"x"]
[{"$nulls":25},"x"]
[{"$nulls":25},"x"]
[{"$nulls":25},"x"]
[{"$nulls":25},"x"]
[{"$nulls":25},"x"]
[{"$nulls":25},"x"]
[{"$nulls":25},"x"]
[{"$nulls":25},"x"]
[{"$nulls":25},"x"]
[{"$nulls":25},"x"]
[{"$nulls":25},"x"]
[{"$nulls":25},"x"]
[{"$nulls":25},"x"]
[{"$nulls":25},"x"]
[{"$nulls":25},"x"]
[{"$nulls":25},"x"]
[{"$nulls":25},"x"]
[{"$nulls":25},"x"]
[{"$nulls":25},"x"]
[{"$nulls":25},"x"]
[{"$nulls":25},"x"]
[{"$nulls":25},"x"]
[{"$nulls":25},"x"]
[{"$nulls":25},"x"]
[{"$nulls":25},"x"]
[{"$nulls":25},"x"]
[{"$nulls":25},"x"]
[{"$nulls":25},"x"]
["x","x","x","x","x","x","x","x","x","x","x","x","x","x","x","x","x","x","x","x","x","x","x","x","x","x"]

{"sheet":"CPMG-1D_acquisition","index":15,"n_rows":466,"n_cols":26,"rows_kept":466}
["proton nmr peaks",{"$nulls":24},"x"]
["peak index","region","index (F1)","ν (F1) [ppm]","ν (F1) [Hz]","intensity [abs]","intensity [rel]","half width [ppm]","half width [Hz]","annotation",{"$nulls":15},"x"]
[1,1,"22158.5","8.0522","4832.3663","995120.38","3.64","0.0018","1.1004",{"$nulls":16},"x"]
[2,1,"22164.4","8.0504","4831.2860","1013430.62","3.70","0.0018","1.1004",{"$nulls":16},"x"]
[3,2,"22847.3","7.8417","4706.0389","624458.25","2.28","0.0015","0.9170",{"$nulls":16},"x"]
[4,2,"22852.2","7.8402","4705.1387","714243.84","2.62","0.0034","2.0174",{"$nulls":16},"x"]
[5,2,"22891.2","7.8283","4697.9972","838050.94","3.08","0.0024","1.4672",{"$nulls":16},"x"]
[6,2,"22898.7","7.8260","4696.6169","674763.66","2.47","0.0018","1.1004"]
[7,3,"23168.0","7.7437","4647.2262","541356.03","1.99","0.0040","2.3842"]
[8,3,"23211.5","7.7304","4639.2444","579867.72","2.12","0.0037","2.2008"]
[9,4,"23452.7","7.6567","4595.0149","82412.22","0.30","0.0015","0.9170"]
[10,4,"23458.9","7.6548","4593.8746","152791.06","0.56","0.0021","1.2838"]
[11,4,"23465.1","7.6529","4592.7344","93615.78","0.34","0.0018","1.1004"]
[12,4,"23490.3","7.6452","4588.1134","124807.84","0.46","0.0015","0.9170"]
[13,4,"23499.5","7.6424","4586.4330","428250.59","1.57","0.0024","1.4672"]
[14,4,"23508.3","7.6397","4584.8127","157615.50","0.58","0.0012","0.7336"]
[15,4,"23533.5","7.6320","4580.1917","174767.06","0.64","0.0015","0.9170"]
[16,4,"23540.0","7.6300","4578.9914","289428.47","1.07","0.0024","1.4672"]
[17,4,"23546.6","7.6280","4577.7911","160595.34","0.59","0.0015","0.9170"]
[18,5,"23742.9","7.5680","4541.7833","660344.47","2.43","0.0024","1.4672"]
[19,5,"23787.1","7.5545","4533.6816","1397313.50","5.13","0.0034","2.0174"]
[20,5,"23828.7","7.5418","4526.0599","792944.50","2.90","0.0040","2.3842"]
[21,6,"24509.6","7.3337","4401.1729","957393.75","3.50","0.0031","1.8340"]
[22,7,"24620.5","7.2998","4380.8285","251014.47","0.92","0.0018","1.1004"]
[23,7,"24625.8","7.2982","4379.8683","258637.22","0.95","0.0018","1.1004"]
[24,7,"24664.4","7.2864","4372.7868","534128.78","1.95","0.0046","2.7510"]
[25,7,"24703.3","7.2745","4365.6452","314935.59","1.15","0.0018","1.1004"]
[26,7,"24708.9","7.2728","4364.6250","303904.62","1.11","0.0018","1.1004"]
[27,8,"24897.7","7.2151","4329.9975","362827.62","1.33","0.0015","0.9170"]
[28,8,"24902.3","7.2137","4329.1573","370019.09","1.36","0.0018","1.1004"]
[29,8,"24940.9","7.2019","4322.0758","606089.59","2.23","0.0040","2.3842"]
[30,8,"24979.2","7.1902","4315.0543","279613.53","1.02","0.0015","0.9170"]
[31,8,"24984.1","7.1887","4314.1541","265551.53","0.98","0.0015","0.9170"]
[32,9,"25085.5","7.1577","4295.5500","875880.91","3.20","0.0043","2.5676"]
[33,10,"27151.3","6.5264","3916.6880","2047351.03","7.49","0.0012","0.7336"]
[34,11,"31227.9","5.2806","3169.0461","195098.62","0.72","0.0028","1.6506"]
[35,11,"31248.5","5.2743","3165.2653","202062.06","0.74","0.0024","1.4672"]
[36,11,"31335.2","5.2478","3149.3619","273208.69","1.00","0.0024","1.4672"]
[37,11,"31355.5","5.2416","3145.6411","276608.66","1.01","0.0024","1.4672"]
[38,12,"33251.1","4.6623","2797.9858","421565.12","1.56","0.0015","0.9170"]
[39,12,"33294.3","4.6491","2790.0641","444005.53","1.62","0.0015","0.9170"]
[40,12,"33450.8","4.6013","2761.3779","462588.72","1.69","0.0015","0.9170"]
[41,12,"33493.6","4.5882","2753.5162","502005.69","1.84","0.0015","0.9170"]
[42,13,"33539.1","4.5743","2745.1744","80451.22","0.29","0.0064","3.8514"]
[43,13,"33546.3","4.5721","2743.8541","80844.56","0.30","0.0061","3.6680"]
[44,13,"33576.7","4.5628","2738.2729","81837.09","0.30","0.0061","3.6680"]
[45,13,"33584.3","4.5605","2736.8926","81387.88","0.30","0.0058","3.4846"]
[46,13,"33628.1","4.5471","2728.8508","31433.56","0.12","0.0034","2.0174"]
[47,14,"34494.6","4.2823","2569.9364","86204.62","0.32","0.0018","1.1004"]
[48,14,"34522.1","4.2739","2564.8953","112545.56","0.41","0.0021","1.2838"]
[49,14,"34530.6","4.2713","2563.3350","288375.78","1.05","0.0018","1.1004"]
[50,14,"34557.4","4.2631","2558.4139","306119.38","1.12","0.0021","1.2838"]
[51,14,"34566.6","4.2603","2556.7336","306227.09","1.12","0.0024","1.4672"]
[52,14,"34593.4","4.2521","2551.8125","295126.22","1.08","0.0018","1.1004"]
[53,14,"34602.3","4.2494","2550.1921","117011.09","0.43","0.0021","1.2838"]
[54,14,"34629.4","4.2411","2545.2111","90267.12","0.33","0.0018","1.1004"]
[55,15,"34919.3","4.1525","2492.0396","242930.03","0.89","0.0024","1.4672"]
[56,15,"34953.7","4.1420","2485.7382","275249.25","1.01","0.0024","1.4672"]
[57,15,"34966.8","4.1380","2483.3377","332724.06","1.22","0.0031","1.8340"]
[58,15,"35002.1","4.1272","2476.8563","326082.31","1.20","0.0024","1.4672"]
[59,15,"35009.3","4.1250","2475.5360","310432.84","1.14","0.0015","0.9170"]
[60,15,"35047.3","4.1134","2468.5745","274467.59","1.00","0.0015","0.9170"]
[61,15,"35085.2","4.1018","2461.6130","171692.34","0.63","0.0028","1.6506"]
[62,16,"35114.4","4.0929","2456.2718","107205.62","0.39","0.0037","2.2008"]
[63,16,"35121.9","4.0906","2454.8915","107194.53","0.39","0.0046","2.7510"]
[64,16,"35154.9","4.0805","2448.8302","113775.38","0.42","0.0046","2.7510"]
[65,16,"35171.3","4.0755","2445.8295","622379.34","2.28","0.0024","1.4672"]
[66,16,"35184.7","4.0714","2443.3690","440387.47","1.62","0.0031","1.8340"]
[67,16,"35198.8","4.0671","2440.7885","1069235.44","3.91","0.0021","1.2838"]
[68,16,"35215.8","4.0619","2437.6678","840157.97","3.08","0.0043","2.5676"]
[69,16,"35224.6","4.0592","2436.0474","707310.06","2.58","0.0028","1.6506"]
[70,16,"35240.7","4.0543","2433.1068","682306.06","2.49","0.0034","2.0174"]
[71,16,"35253.4","4.0504","2430.7663","356429.56","1.30","0.0024","1.4672"]
[72,17,"35342.8","4.0231","2414.3827","653548.91","2.39","0.0028","1.6506"]
[73,17,"35368.3","4.0153","2409.7017","977668.41","3.58","0.0018","1.1004"]
[74,17,"35382.4","4.0110","2407.1212","800910.53","2.93","0.0024","1.4672"]
[75,17,"35408.9","4.0029","2402.2601","930995.31","3.45","0.0015","0.9170"]
[76,17,"35435.7","3.9947","2397.3390","209118.56","0.76","0.0046","2.7510"]
[77,18,"35533.9","3.9647","2379.3351","3401743.12","12.55","0.0021","1.2838"]
[78,19,"35611.4","3.9410","2365.1121","414950.59","1.52","0.0037","2.2008"]
[79,19,"35627.5","3.9361","2362.1714","436798.12","1.60","0.0037","2.2008"]
[80,20,"35692.6","3.9162","2350.2288","420885.56","1.54","0.0018","1.1004"]
[81,20,"35704.0","3.9127","2348.1284","360223.41","1.33","0.0028","1.6506"]
[82,20,"35713.9","3.9097","2346.3280","683440.72","2.53","0.0024","1.4672"]
[83,20,"35739.4","3.9019","2341.6470","3127638.12","11.43","0.0024","1.4672"]
[84,20,"35759.3","3.8958","2337.9862","513714.09","1.88","0.0028","1.6506"]
[85,20,"35770.8","3.8923","2335.8857","449390.78","1.66","0.0028","1.6506"]
[86,20,"35782.9","3.8886","2333.6653","408399.69","1.51","0.0028","1.6506"]
[87,21,"35827.4","3.8750","2325.5035","120453.09","0.44","0.0018","1.1004"]
[88,21,"35845.1","3.8696","2322.2628","102212.41","0.38","0.0021","1.2838"]
[89,22,"35884.7","3.8575","2315.0012","311269.09","1.14","0.0024","1.4672"]
[90,22,"35900.7","3.8526","2312.0606","384034.03","1.40","0.0034","2.0174"]
[91,22,"35924.9","3.8452","2307.6196","140977.31","0.52","0.0040","2.3842"]
[92,22,"35937.3","3.8414","2305.3391","102962.06","0.38","0.0040","2.3842"]
[93,22,"35956.3","3.8356","2301.8584","459215.81","1.68","0.0031","1.8340"]
[94,22,"35982.8","3.8275","2296.9973","329008.72","1.21","0.0028","1.6506"]
[95,22,"36004.1","3.8210","2293.0965","223722.34","0.83","0.0018","1.1004"]
[96,22,"36039.4","3.8102","2286.6151","265074.06","0.97","0.0018","1.1004"]
[97,22,"36060.7","3.8037","2282.7142","119035.06","0.44","0.0021","1.2838"]
[98,23,"36079.0","3.7981","2279.3535","510765.12","1.90","0.0015","0.9170"]
[99,23,"36093.4","3.7937","2276.7129","481211.06","1.76","0.0021","1.2838"]
[100,23,"36109.8","3.7887","2273.7123","361300.97","1.32","0.0037","2.2008"]
[101,23,"36118.6","3.7860","2272.0919","763912.38","2.79","0.0024","1.4672"]
[102,23,"36127.1","3.7834","2270.5316","885651.66","3.24","0.0031","1.8340"]
[103,23,"36143.5","3.7784","2267.5309","673679.53","2.46","0.0031","1.8340"]
[104,23,"36161.5","3.7729","2264.2302","751283.78","2.75","0.0037","2.2008"]
[105,23,"36175.2","3.7687","2261.7097","296783.69","1.09","0.0024","1.4672"]
[106,23,"36182.8","3.7664","2260.3294","285725.25","1.05","0.0021","1.2838"]
[107,23,"36194.5","3.7628","2258.1689","558540.72","2.05","0.0031","1.8340"]
[108,23,"36207.3","3.7589","2255.8284","814941.00","3.00","0.0031","1.8340"]
[109,23,"36219.1","3.7553","2253.6679","812172.38","2.98","0.0031","1.8340"]
[110,23,"36248.5","3.7463","2248.2668","508011.25","1.86","0.0040","2.3842"]
[111,23,"36268.8","3.7401","2244.5460","505992.16","1.86","0.0028","1.6506"]
[112,23,"36279.0","3.7370","2242.6856","724125.84","2.67","0.0024","1.4672"]
[113,23,"36315.0","3.7260","2236.0841","452822.59","1.66","0.0064","3.8514"]
[114,23,"36332.3","3.7207","2232.9034","399180.75","1.46","0.0024","1.4672"]
[115,23,"36336.9","3.7193","2232.0633","368381.53","1.35","0.0018","1.1004"]
[116,23,"36345.7","3.7166","2230.4429","414285.88","1.52","0.0028","1.6506"]
[117,23,"36356.9","3.7132","2228.4025","296376.94","1.09","0.0024","1.4672"]
[118,23,"36362.1","3.7116","2227.4423","283178.16","1.04","0.0021","1.2838"]
[119,23,"36373.2","3.7082","2225.4018","444575.84","1.63","0.0034","2.0174"]
[120,23,"36399.4","3.7002","2220.6008","160720.84","0.59","0.0021","1.2838"]
[121,23,"36404.0","3.6988","2219.7606","171695.84","0.63","0.0024","1.4672"]
[122,24,"36452.4","3.6840","2210.8787","976646.59","3.57","0.0018","1.1004"]
[123,24,"36474.0","3.6774","2206.9178","974377.78","3.61","0.0015","0.9170"]
[124,24,"36503.4","3.6684","2201.5166","356823.03","1.30","0.0018","1.1004"]
[125,24,"36522.8","3.6625","2197.9759","355230.00","1.30","0.0018","1.1004"]
[126,24,"36557.8","3.6518","2191.5545","411313.91","1.52","0.0015","0.9170"]
[127,24,"36576.7","3.6460","2188.0737","399409.31","1.48","0.0018","1.1004"]
[128,25,"36648.7","3.6240","2174.8709","829780.56","3.07","0.0015","0.9170"]
[129,25,"36672.6","3.6167","2170.4899","854636.69","3.13","0.0012","0.7336"]
[130,25,"36707.3","3.6061","2164.1286","877322.47","3.21","0.0012","0.7336"]
[131,25,"36734.1","3.5979","2159.2075","843585.84","3.11","0.0015","0.9170"]
[132,26,"36831.0","3.5683","2141.4436","4556086.41","17.02","0.0015","0.9170"]
[133,27,"36865.7","3.5577","2135.0823","268467.59","0.99","0.0015","0.9170"]
[134,27,"36886.6","3.5513","2131.2414","250222.41","0.91","0.0018","1.1004"]
[135,27,"36919.7","3.5412","2125.1801","220889.91","0.81","0.0015","0.9170"]
[136,27,"36940.3","3.5349","2121.3993","225445.00","0.83","0.0015","0.9170"]
[137,28,"36965.5","3.5272","2116.7783","765153.66","2.80","0.0024","1.4672"]
[138,28,"36983.5","3.5217","2113.4776","501686.38","1.83","0.0024","1.4672"]
[139,28,"36993.6","3.5186","2111.6172","1275213.56","4.66","0.0024","1.4672"]
[140,28,"37020.1","3.5105","2106.7561","744358.53","2.73","0.0024","1.4672"]
[141,28,"37043.7","3.5033","2102.4352","1004361.25","3.68","0.0037","2.2008"]
[142,28,"37072.8","3.4944","2097.0940","334588.47","1.23","0.0037","2.2008"]
[143,28,"37093.1","3.4882","2093.3732","770407.69","2.83","0.0021","1.2838"]
[144,28,"37104.2","3.4848","2091.3328","207634.31","0.76","0.0024","1.4672"]
[145,28,"37132.4","3.4762","2086.1717","498742.91","1.82","0.0046","2.7510"]
[146,28,"37146.1","3.4720","2083.6511","332956.91","1.22","0.0028","1.6506"]
[147,28,"37157.9","3.4684","2081.4907","644136.59","2.37","0.0034","2.0174"]
[148,28,"37177.2","3.4625","2077.9499","352663.16","1.29","0.0028","1.6506"]
[149,28,"37189.3","3.4588","2075.7294","235007.88","0.86","0.0031","1.8340"]
[150,29,"37253.5","3.4392","2063.9669","561595.00","2.05","0.0037","2.2008"]
[151,29,"37290.4","3.4279","2057.1854","1082383.31","3.96","0.0037","2.2008"]
[152,29,"37296.6","3.4260","2056.0452","792354.03","2.90","0.0015","0.9170"]
[153,29,"37306.5","3.4230","2054.2448","1030637.25","3.77","0.0034","2.0174"]
[154,29,"37344.1","3.4115","2047.3433","752201.25","2.75","0.0037","2.2008"]
[155,29,"37360.1","3.4066","2044.4026","255218.75","0.93","0.0043","2.5676"]
[156,29,"37384.0","3.3993","2040.0217","245382.84","0.90","0.0034","2.0174"]
[157,29,"37393.2","3.3965","2038.3413","262002.09","0.96","0.0021","1.2838"]
[158,30,"37435.4","3.3836","2030.5996","66784.66","0.24","0.0040","2.3842"]
[159,31,"37489.4","3.3671","2020.6975","288484.34","1.06","0.0018","1.1004"]
[160,31,"37528.6","3.3551","2013.4959","547914.34","2.00","0.0021","1.2838"]
[161,31,"37552.9","3.3477","2009.0550","211253.69","0.77","0.0028","1.6506"]
[162,31,"37566.9","3.3434","2006.4744","307924.22","1.13","0.0031","1.8340"]
[163,31,"37584.3","3.3381","2003.2937","515642.56","1.88","0.0031","1.8340"]
[164,31,"37591.1","3.3360","2002.0335","441277.97","1.62","0.0018","1.1004"]
[165,31,"37628.1","3.3247","1995.2520","557884.62","2.05","0.0028","1.6506"]
[166,31,"37669.0","3.3122","1987.7504","424985.84","1.56","0.0052","3.1178"]
[167,31,"37708.6","3.3001","1980.4888","458963.34","1.68","0.0046","2.7510"]
[168,31,"37761.0","3.2841","1970.8867","531168.19","1.94","0.0034","2.0174"]
[169,32,"37790.1","3.2752","1965.5456","588592.28","2.15","0.0034","2.0174"]
[170,32,"37798.6","3.2726","1963.9852","612856.75","2.24","0.0024","1.4672"]
[171,32,"37841.5","3.2595","1956.1235","693041.94","2.53","0.0024","1.4672"]
[172,32,"37849.3","3.2571","1954.6832","497915.19","1.82","0.0021","1.2838"]
[173,32,"37870.6","3.2506","1950.7824","355208.62","1.30","0.0034","2.0174"]
[174,33,"37908.2","3.2391","1943.8809","719683.22","2.63","0.0028","1.6506"]
[175,34,"37986.8","3.2151","1929.4778","624418.44","2.29","0.0034","2.0174"]
[176,34,"38071.8","3.1891","1913.8744","344657.72","1.26","0.0034","2.0174"]
[177,35,"38583.3","3.0328","1820.0741","1653177.88","6.05","0.0024","1.4672"]
[178,35,"38624.2","3.0203","1812.5724","2087954.41","7.64","0.0046","2.7510"]
[179,35,"38666.1","3.0075","1804.8908","1720482.38","6.33","0.0021","1.2838"]
[180,36,"38765.9","2.9770","1786.5868","351264.34","1.29","0.0018","1.1004"]
[181,36,"38789.8","2.9697","1782.2059","369265.16","1.35","0.0018","1.1004"]
[182,36,"38857.8","2.9489","1769.7232","742458.44","2.74","0.0018","1.1004"]
[183,36,"38881.7","2.9416","1765.3422","714647.75","2.62","0.0018","1.1004"]
[184,37,"39013.3","2.9014","1741.2170","723629.34","2.67","0.0021","1.2838"]
[185,37,"39053.5","2.8891","1733.8354","713490.88","2.61","0.0018","1.1004"]
[186,37,"39105.2","2.8733","1724.3533","347617.69","1.28","0.0015","0.9170"]
[187,37,"39145.8","2.8609","1716.9117","350307.06","1.29","0.0018","1.1004"]
[188,38,"39231.9","2.8346","1701.1283","449997.66","1.66","0.0015","0.9170"]
[189,38,"39252.8","2.8282","1697.2875","467574.06","1.72","0.0018","1.1004"]
[190,38,"39327.1","2.8055","1683.6645","739543.47","2.74","0.0015","0.9170"]
[191,38,"39348.0","2.7991","1679.8237","718504.75","2.66","0.0015","0.9170"]
[192,39,"39604.9","2.7206","1632.7135","9979684.94","36.81","0.0015","0.9170"]
[193,40,"39651.7","2.7063","1624.1316","738978.09","2.70","0.0018","1.1004"]
[194,40,"39700.8","2.6913","1615.1297","452700.66","1.66","0.0018","1.1004"]
[195,40,"39746.9","2.6772","1606.6679","451911.75","1.66","0.0015","0.9170"]
[196,41,"40002.5","2.5991","1559.7977","52000.44","0.19","0.0015","0.9170"]
[197,42,"40310.7","2.5049","1503.2655","85296.56","0.31","0.0024","1.4672"]
[198,42,"40348.4","2.4934","1496.3640","106370.88","0.39","0.0028","1.6506"]
[199,42,"40359.2","2.4901","1494.3835","106080.59","0.39","0.0028","1.6506"]
[200,43,"40385.3","2.4821","1489.5825","190541.81","0.70","0.0018","1.1004"]
[201,43,"40394.8","2.4792","1487.8421","429096.91","1.58","0.0028","1.6506"]
[202,44,"40432.5","2.4677","1480.9406","454305.69","1.66","0.0028","1.6506"]
[203,44,"40443.9","2.4642","1478.8402","708916.09","2.60","0.0031","1.8340"]
[204,44,"40468.5","2.4567","1474.3392","579832.75","2.12","0.0028","1.6506"]
[205,44,"40483.2","2.4522","1471.6386","834751.50","3.06","0.0034","2.0174"]
[206,44,"40492.7","2.4493","1469.8982","517445.06","1.89","0.0024","1.4672"]
[207,44,"40507.1","2.4449","1467.2577","576529.41","2.13","0.0024","1.4672"]
[208,44,"40517.9","2.4416","1465.2772","594139.56","2.20","0.0028","1.6506"]
[209,44,"40530.0","2.4379","1463.0568","555781.88","2.05","0.0031","1.8340"]
[210,44,"40552.2","2.4311","1458.9759","547719.06","2.03","0.0015","0.9170"]
[211,44,"40567.9","2.4263","1456.0953","124827.00","0.46","0.0031","1.8340"]
[212,44,"40576.8","2.4236","1454.4749","122664.19","0.45","0.0024","1.4672"]
[213,44,"40601.6","2.4160","1449.9139","149045.81","0.55","0.0018","1.1004"]
[214,44,"40613.7","2.4123","1447.6934","116664.34","0.43","0.0031","1.8340"]
[215,44,"40635.7","2.4056","1443.6726","117727.72","0.43","0.0015","0.9170"]
[216,45,"40704.4","2.3846","1431.0698","93986.47","0.34","0.0021","1.2838"]
[217,45,"40744.3","2.3724","1423.7483","183880.69","0.67","0.0034","2.0174"]
[218,45,"40752.2","2.3700","1422.3079","117635.19","0.43","0.0018","1.1004"]
[219,45,"40781.0","2.3612","1417.0268","164861.22","0.60","0.0043","2.5676"]
[220,45,"40792.7","2.3576","1414.8663","176206.75","0.64","0.0031","1.8340"]
[221,45,"40814.0","2.3511","1410.9655","247854.28","0.91","0.0028","1.6506"]
[222,45,"40824.5","2.3479","1409.0451","165656.78","0.61","0.0040","2.3842"]
[223,45,"40852.9","2.3392","1403.8239","116386.22","0.43","0.0031","1.8340"]
[224,45,"40861.5","2.3366","1402.2636","237580.94","0.87","0.0024","1.4672"]
[225,45,"40899.1","2.3251","1395.3621","78199.34","0.29","0.0028","1.6506"]
[226,45,"40918.4","2.3192","1391.8213","23200.00","0.08","0.0037","2.2008"]
[227,46,"40943.9","2.3114","1387.1403","17506.16","0.06","0.0037","2.2008"]
[228,46,"40957.7","2.3072","1384.6198","69200.44","0.25","0.0024","1.4672"]
[229,46,"40981.5","2.2999","1380.2388","73496.25","0.27","0.0028","1.6506"]
[230,46,"40995.9","2.2955","1377.5983","172977.03","0.64","0.0024","1.4672"]
[231,46,"41019.8","2.2882","1373.2173","177239.53","0.65","0.0031","1.8340"]
[232,46,"41034.2","2.2838","1370.5767","237852.28","0.88","0.0024","1.4672"]
[233,46,"41057.8","2.2766","1366.2558","235679.22","0.87","0.0021","1.2838"]
[234,46,"41072.2","2.2722","1363.6152","188762.59","0.69","0.0024","1.4672"]
[235,46,"41096.1","2.2649","1359.2343","180271.38","0.66","0.0024","1.4672"]
[236,46,"41110.5","2.2605","1356.5937","82368.06","0.30","0.0031","1.8340"]
[237,46,"41134.4","2.2532","1352.2128","75784.34","0.28","0.0028","1.6506"]
[238,47,"41329.7","2.1935","1316.3850","47429.62","0.17","0.0018","1.1004"]
[239,48,"41368.7","2.1816","1309.2435","77896.47","0.28","0.0021","1.2838"]
[240,48,"41376.2","2.1793","1307.8632","83583.28","0.31","0.0021","1.2838"]
[241,48,"41389.6","2.1752","1305.4026","882534.44","3.23","0.0015","0.9170"]
[242,48,"41400.4","2.1719","1303.4222","162042.31","0.59","0.0012","0.7336"]
[243,48,"41408.9","2.1693","1301.8619","338837.84","1.25","0.0040","2.3842"]
[244,48,"41429.5","2.1630","1298.0810","1712586.34","6.26","0.0018","1.1004"]
[245,48,"41438.7","2.1602","1296.4007","609364.31","2.23","0.0024","1.4672"]
[246,48,"41455.7","2.1550","1293.2800","384979.41","1.41","0.0031","1.8340"]
[247,48,"41470.1","2.1506","1290.6394","1182118.69","4.38","0.0034","2.0174"]
[248,48,"41487.8","2.1452","1287.3987","595583.47","2.19","0.0037","2.2008"]
[249,48,"41510.7","2.1382","1283.1978","317538.25","1.16","0.0028","1.6506"]
[250,48,"41524.1","2.1341","1280.7373","599833.84","2.20","0.0024","1.4672"]
[251,48,"41559.8","2.1232","1274.1959","242938.62","0.89","0.0034","2.0174"]
[252,49,"41591.2","2.1136","1268.4346","49894.88","0.18","0.0024","1.4672"]
[253,49,"41602.3","2.1102","1266.3942","81209.75","0.30","0.0024","1.4672"]
[254,49,"41629.8","2.1018","1261.3531","91757.22","0.34","0.0024","1.4672"]
[255,49,"41639.3","2.0989","1259.6127","53127.19","0.19","0.0024","1.4672"]
[256,49,"41665.4","2.0909","1254.8117","211934.62","0.77","0.0037","2.2008"]
[257,49,"41706.0","2.0785","1247.3701","284524.28","1.04","0.0037","2.2008"]
[258,49,"41741.0","2.0678","1240.9487","242056.62","0.89","0.0037","2.2008"]
[259,49,"41772.8","2.0581","1235.1274","193832.50","0.71","0.0052","3.1178"]
[260,49,"41785.2","2.0543","1232.8469","112407.38","0.41","0.0021","1.2838"]
[261,49,"41800.9","2.0495","1229.9663","133477.00","0.49","0.0031","1.8340"]
[262,49,"41808.1","2.0473","1228.6460","139587.47","0.51","0.0031","1.8340"]
[263,49,"41832.3","2.0399","1224.2051","177125.81","0.65","0.0031","1.8340"]
[264,49,"41869.3","2.0286","1217.4236","334388.06","1.22","0.0031","1.8340"]
[265,49,"41906.0","2.0174","1210.7021","402389.16","1.48","0.0034","2.0174"]
[266,49,"41932.1","2.0094","1205.9011","307847.75","1.13","0.0043","2.5676"]
[267,49,"41943.9","2.0058","1203.7406","301452.72","1.10","0.0040","2.3842"]
[268,49,"41982.5","1.9940","1196.6591","266679.44","0.97","0.0037","2.2008"]
[269,49,"42021.8","1.9820","1189.4575","201458.66","0.74","0.0037","2.2008"]
[270,49,"42036.5","1.9775","1186.7569","235375.78","0.86","0.0040","2.3842"]
[271,49,"42045.7","1.9747","1185.0766","244320.34","0.89","0.0034","2.0174"]
[272,49,"42058.8","1.9707","1182.6761","89025.91","0.33","0.0024","1.4672"]
[273,49,"42077.1","1.9651","1179.3153","137087.84","0.50","0.0067","4.0348"]
[274,49,"42109.5","1.9552","1173.3740","56634.34","0.21","0.0034","2.0174"]
[275,49,"42121.6","1.9515","1171.1536","76998.72","0.28","0.0046","2.7510"]
[276,49,"42134.4","1.9476","1168.8131","37802.00","0.14","0.0028","1.6506"]
[277,49,"42154.3","1.9415","1165.1523","167964.91","0.62","0.0031","1.8340"]
[278,49,"42187.0","1.9315","1159.1510","199312.59","0.73","0.0049","2.9344"]
[279,49,"42211.6","1.9240","1154.6500","199609.12","0.73","0.0055","3.3012"]
[280,49,"42244.3","1.9140","1148.6487","181852.31","0.66","0.0037","2.2008"]
[281,49,"42276.7","1.9041","1142.7074","81931.12","0.30","0.0037","2.2008"]
[282,49,"42321.9","1.8903","1134.4256","36724.78","0.13","0.0037","2.2008"]
[283,49,"42354.9","1.8802","1128.3643","20530.78","0.08","0.0058","3.4846"]
[284,50,"42710.0","1.7717","1063.2502","28638.38","0.10","0.0064","3.8514"]
[285,50,"42747.6","1.7602","1056.3487","55690.88","0.20","0.0043","2.5676"]
[286,50,"42780.6","1.7501","1050.2874","399265.19","1.46","0.0031","1.8340"]
[287,50,"42821.9","1.7375","1042.7258","878915.84","3.22","0.0070","4.2182"]
[288,50,"42864.1","1.7246","1034.9841","1356709.88","4.97","0.0052","3.1178"]
[289,50,"42906.3","1.7117","1027.2424","902303.41","3.30","0.0070","4.2182"]
[290,50,"42948.2","1.6989","1019.5607","426985.16","1.57","0.0028","1.6506"]
[291,51,"43005.1","1.6815","1009.1185","69643.50","0.26","0.0046","2.7510"]
[292,51,"43038.5","1.6713","1002.9972","87218.97","0.32","0.0052","3.1178"]
[293,51,"43065.0","1.6632","998.1361","68570.66","0.25","0.0046","2.7510"]
[294,51,"43076.1","1.6598","996.0957","76796.47","0.28","0.0043","2.5676"]
[295,51,"43097.7","1.6532","992.1348","73164.38","0.27","0.0052","3.1178"]
[296,51,"43114.4","1.6481","989.0741","54769.62","0.20","0.0037","2.2008"]
[297,51,"43135.0","1.6418","985.2933","62944.94","0.23","0.0034","2.0174"]
[298,51,"43151.4","1.6368","982.2927","23606.09","0.09","0.0040","2.3842"]
[299,51,"43171.3","1.6307","978.6319","41700.22","0.15","0.0037","2.2008"]
[300,52,"43271.1","1.6002","960.3279","27228.84","0.10","0.0028","1.6506"]
[301,52,"43283.6","1.5964","958.0474","34837.69","0.13","0.0034","2.0174"]
[302,52,"43292.7","1.5936","956.3671","136746.94","0.51","0.0018","1.1004"]
[303,52,"43310.1","1.5883","953.1864","39875.69","0.15","0.0037","2.2008"]
[304,52,"43333.3","1.5812","948.9255","529293.16","1.94","0.0018","1.1004"]
[305,52,"43373.6","1.5689","941.5439","966492.22","3.53","0.0018","1.1004"]
[306,52,"43413.8","1.5566","934.1623","940171.34","3.46","0.0018","1.1004"]
[307,52,"43454.1","1.5443","926.7807","493454.22","1.83","0.0015","0.9170"]
[308,52,"43494.3","1.5320","919.3991","114472.84","0.42","0.0015","0.9170"]
[309,53,"43560.7","1.5117","907.2164","61088.53","0.22","0.0031","1.8340"]
[310,53,"43601.0","1.4994","899.8348","405247.09","1.49","0.0040","2.3842"]
[311,53,"43618.3","1.4941","896.6541","3038073.31","11.11","0.0018","1.1004"]
[312,53,"43642.6","1.4867","892.2132","756174.56","2.76","0.0037","2.2008"]
[313,53,"43657.9","1.4820","889.3926","3138979.12","11.58","0.0018","1.1004"]
[314,53,"43682.5","1.4745","884.8916","827948.28","3.03","0.0058","3.4846"]
[315,53,"43703.7","1.4680","880.9907","542977.16","1.98","0.0046","2.7510"]
[316,53,"43716.5","1.4641","878.6502","543458.16","1.99","0.0034","2.0174"]
[317,53,"43726.3","1.4611","876.8498","736389.09","2.69","0.0046","2.7510"]
[318,53,"43742.7","1.4561","873.8492","670558.59","2.45","0.0031","1.8340"]
[319,53,"43765.6","1.4491","869.6483","526552.34","1.93","0.0028","1.6506"]
[320,53,"43781.3","1.4443","866.7677","282937.69","1.03","0.0028","1.6506"]
[321,53,"43806.2","1.4367","862.2067","39587.62","0.15","0.0049","2.9344"]
[322,54,"44108.8","1.3442","806.6947","3115763.00","11.50","0.0018","1.1004"]
[323,54,"44119.0","1.3411","804.8343","2095962.03","7.76","0.0021","1.2838"]
[324,54,"44144.8","1.3332","800.0932","3110442.31","11.41","0.0018","1.1004"]
[325,54,"44157.0","1.3295","797.8727","1952064.88","7.23","0.0018","1.1004"]
[326,55,"44190.0","1.3194","791.8114","17877.66","0.07","0.0012","0.7336"]
[327,55,"44194.3","1.3181","791.0313","14363.97","0.05","0.0012","0.7336"]
[328,55,"44198.2","1.3169","790.3111","11844.97","0.04","0.0012","0.7336"]
[329,55,"44231.6","1.3067","784.1898","62139.56","0.23","0.0021","1.2838"]
[330,55,"44250.5","1.3009","780.7090","10593.25","0.04","0.0012","0.7336"]
[331,55,"44272.1","1.2943","776.7482","202871.78","0.75","0.0021","1.2838"]
[332,55,"44282.3","1.2912","774.8878","80728.38","0.30","0.0021","1.2838"]
[333,55,"44312.4","1.2820","769.3666","242369.03","0.89","0.0034","2.0174"]
[334,55,"44322.9","1.2788","767.4462","213608.28","0.78","0.0028","1.6506"]
[335,55,"44346.1","1.2717","763.1852","194125.25","0.71","0.0028","1.6506"]
[336,55,"44352.6","1.2697","761.9850","154357.53","0.56","0.0018","1.1004"]
[337,55,"44363.1","1.2665","760.0646","229259.03","0.85","0.0031","1.8340"]
[338,55,"44386.0","1.2595","755.8637","189540.28","0.70","0.0031","1.8340"]
[339,55,"44396.8","1.2562","753.8832","189269.75","0.69","0.0040","2.3842"]
[340,55,"44426.3","1.2472","748.4821","77911.50","0.28","0.0024","1.4672"]
[341,55,"44436.7","1.2440","746.5616","169248.38","0.62","0.0024","1.4672"]
[342,55,"44461.3","1.2365","742.0607","21202.31","0.08","0.0034","2.0174"]
[343,55,"44476.3","1.2319","739.3001","63870.94","0.23","0.0021","1.2838"]
[344,55,"44496.9","1.2256","735.5192","16272.09","0.06","0.0031","1.8340"]
[345,55,"44511.3","1.2212","732.8787","11006.12","0.04","0.0021","1.2838"]
[346,56,"45059.8","1.0536","632.2969","2750824.62","10.07","0.0018","1.1004"]
[347,56,"45098.1","1.0419","625.2754","2679479.22","9.90","0.0021","1.2838"]
[348,56,"45166.1","1.0211","612.7927","3139881.50","11.52","0.0018","1.1004"]
[349,56,"45204.4","1.0094","605.7712","3139900.47","11.47","0.0018","1.1004"]
[350,56,"45223.1","1.0037","602.3504","2859787.94","10.53","0.0021","1.2838"]
[351,56,"45261.3","0.9920","595.3289","2743840.75","10.03","0.0018","1.1004"]
[352,57,"45378.8","0.9561","573.7842","1520703.50","5.59","0.0021","1.2838"]
[353,57,"45419.4","0.9437","566.3426","3104352.62","11.39","0.0018","1.1004"]
[354,57,"45459.6","0.9314","558.9610","1343390.62","4.92","0.0018","1.1004"]
[355,57,"45522.5","0.9122","547.4385","1333040.31","4.87","0.0012","0.7336"]
[356,57,"45563.0","0.8998","539.9969","2544946.81","9.48","0.0015","0.9170"]
[357,57,"45603.3","0.8875","532.6153","1240524.47","4.53","0.0015","0.9170"]
{"$rows_empty":15}
[{"$nulls":25},"x"]
[{"$nulls":25},"x"]
[{"$nulls":25},"x"]
[{"$nulls":25},"x"]
[{"$nulls":25},"x"]
[{"$nulls":25},"x"]
[{"$nulls":25},"x"]
[{"$nulls":25},"x"]
[{"$nulls":10},"|=> you can insert new rows here",{"$nulls":14},"x"]
[{"$nulls":25},"x"]
["proton nmr peaks + sat",{"$nulls":24},"x"]
["peak index","region","index (F1)","ν (F1) [ppm]","ν (F1) [Hz]","intensity [abs]","intensity [rel]","half width [ppm]","half width [Hz]","annotation",{"$nulls":15},"x"]
[{"$nulls":10},"|=> leave unused rows empty",{"$nulls":14},"x"]
[{"$nulls":25},"x"]
[{"$nulls":25},"x"]
[{"$nulls":25},"x"]
[{"$nulls":25},"x"]
[{"$nulls":25},"x"]
[{"$nulls":25},"x"]
[{"$nulls":25},"x"]
[{"$nulls":25},"x"]
[{"$nulls":25},"x"]
[{"$nulls":25},"x"]
[{"$nulls":25},"x"]
[{"$nulls":25},"x"]
[{"$nulls":10},"|=> you can insert new rows here",{"$nulls":14},"x"]
[{"$nulls":25},"x"]
["multiplet",null,null,"use \";\" as separator","[ppm1 .. ppm2]",{"$nulls":20},"x"]
["ν (F1) [ppm]","H's","type","J(Hz)","range (ppm)","atoms","MSI level",{"$nulls":18},"x"]
[{"$nulls":7},"|=> leave unused rows empty",{"$nulls":17},"x"]
[{"$nulls":7},"|=> MSI level: used for biomatrix (later)",{"$nulls":17},"x"]
[{"$nulls":7},"NOTE:  if completed, image of the molecule with atom number attribution",{"$nulls":17},"x"]
[{"$nulls":25},"x"]
[{"$nulls":25},"x"]
[{"$nulls":25},"x"]
[{"$nulls":25},"x"]
[{"$nulls":25},"x"]
[{"$nulls":25},"x"]
[{"$nulls":7},"|=> you can insert new rows here",{"$nulls":17},"x"]
[{"$nulls":25},"x"]
[{"$nulls":25},"x"]
[{"$nulls":25},"x"]
[{"$nulls":25},"x"]
[{"$nulls":25},"x"]
[{"$nulls":25},"x"]
[{"$nulls":25},"x"]
[{"$nulls":25},"x"]
[{"$nulls":25},"x"]
[{"$nulls":25},"x"]
[{"$nulls":25},"x"]
[{"$nulls":25},"x"]
[{"$nulls":25},"x"]
[{"$nulls":25},"x"]
[{"$nulls":25},"x"]
[{"$nulls":25},"x"]
[{"$nulls":25},"x"]
[{"$nulls":25},"x"]
[{"$nulls":25},"x"]
[{"$nulls":25},"x"]
[{"$nulls":25},"x"]
[{"$nulls":25},"x"]
[{"$nulls":25},"x"]
[{"$nulls":25},"x"]
[{"$nulls":25},"x"]
[{"$nulls":25},"x"]
[{"$nulls":25},"x"]
[{"$nulls":25},"x"]
[{"$nulls":25},"x"]
[{"$nulls":25},"x"]
[{"$nulls":25},"x"]
[{"$nulls":25},"x"]
[{"$nulls":25},"x"]
[{"$nulls":25},"x"]
[{"$nulls":25},"x"]
[{"$nulls":25},"x"]
[{"$nulls":25},"x"]
[{"$nulls":25},"x"]
[{"$nulls":25},"x"]
[{"$nulls":25},"x"]
[{"$nulls":25},"x"]
[{"$nulls":25},"x"]
[{"$nulls":25},"x"]
[{"$nulls":25},"x"]
[{"$nulls":25},"x"]
[{"$nulls":25},"x"]
[{"$nulls":25},"x"]
[{"$nulls":25},"x"]
[{"$nulls":25},"x"]
[{"$nulls":25},"x"]
[{"$nulls":25},"x"]
[{"$nulls":25},"x"]
["x","x","x","x","x","x","x","x","x","x","x","x","x","x","x","x","x","x","x","x","x","x","x","x","x","x"]

{"sheet":"NOESY-1D_acquisition","index":16,"n_rows":540,"n_cols":26,"rows_kept":540}
["proton nmr peaks",{"$nulls":24},"x"]
["peak index","region","index (F1)","ν (F1) [ppm]","ν (F1) [Hz]","intensity [abs]","intensity [rel]","half width [ppm]","half width [Hz]","annotation",{"$nulls":15},"x"]
[1,1,"22158.5","8.0522","4832.3663","995120.38","3.64","0.0018","1.1004",{"$nulls":16},"x"]
[2,1,"22164.4","8.0504","4831.2860","1013430.62","3.70","0.0018","1.1004",{"$nulls":16},"x"]
[3,2,"22847.3","7.8417","4706.0389","624458.25","2.28","0.0015","0.9170",{"$nulls":16},"x"]
[4,2,"22852.2","7.8402","4705.1387","714243.84","2.62","0.0034","2.0174",{"$nulls":16},"x"]
[5,2,"22891.2","7.8283","4697.9972","838050.94","3.08","0.0024","1.4672",{"$nulls":16},"x"]
[6,2,"22898.7","7.8260","4696.6169","674763.66","2.47","0.0018","1.1004"]
[7,3,"23168.0","7.7437","4647.2262","541356.03","1.99","0.0040","2.3842"]
[8,3,"23211.5","7.7304","4639.2444","579867.72","2.12","0.0037","2.2008"]
[9,4,"23452.7","7.6567","4595.0149","82412.22","0.30","0.0015","0.9170"]
[10,4,"23458.9","7.6548","4593.8746","152791.06","0.56","0.0021","1.2838"]
[11,4,"23465.1","7.6529","4592.7344","93615.78","0.34","0.0018","1.1004"]
[12,4,"23490.3","7.6452","4588.1134","124807.84","0.46","0.0015","0.9170"]
[13,4,"23499.5","7.6424","4586.4330","428250.59","1.57","0.0024","1.4672"]
[14,4,"23508.3","7.6397","4584.8127","157615.50","0.58","0.0012","0.7336"]
[15,4,"23533.5","7.6320","4580.1917","174767.06","0.64","0.0015","0.9170"]
[16,4,"23540.0","7.6300","4578.9914","289428.47","1.07","0.0024","1.4672"]
[17,4,"23546.6","7.6280","4577.7911","160595.34","0.59","0.0015","0.9170"]
[18,5,"23742.9","7.5680","4541.7833","660344.47","2.43","0.0024","1.4672"]
[19,5,"23787.1","7.5545","4533.6816","1397313.50","5.13","0.0034","2.0174"]
[20,5,"23828.7","7.5418","4526.0599","792944.50","2.90","0.0040","2.3842"]
[21,6,"24509.6","7.3337","4401.1729","957393.75","3.50","0.0031","1.8340"]
[22,7,"24620.5","7.2998","4380.8285","251014.47","0.92","0.0018","1.1004"]
[23,7,"24625.8","7.2982","4379.8683","258637.22","0.95","0.0018","1.1004"]
[24,7,"24664.4","7.2864","4372.7868","534128.78","1.95","0.0046","2.7510"]
[25,7,"24703.3","7.2745","4365.6452","314935.59","1.15","0.0018","1.1004"]
[26,7,"24708.9","7.2728","4364.6250","303904.62","1.11","0.0018","1.1004"]
[27,8,"24897.7","7.2151","4329.9975","362827.62","1.33","0.0015","0.9170"]
[28,8,"24902.3","7.2137","4329.1573","370019.09","1.36","0.0018","1.1004"]
[29,8,"24940.9","7.2019","4322.0758","606089.59","2.23","0.0040","2.3842"]
[30,8,"24979.2","7.1902","4315.0543","279613.53","1.02","0.0015","0.9170"]
[31,8,"24984.1","7.1887","4314.1541","265551.53","0.98","0.0015","0.9170"]
[32,9,"25085.5","7.1577","4295.5500","875880.91","3.20","0.0043","2.5676"]
[33,10,"27151.3","6.5264","3916.6880","2047351.03","7.49","0.0012","0.7336"]
[34,11,"31227.9","5.2806","3169.0461","195098.62","0.72","0.0028","1.6506"]
[35,11,"31248.5","5.2743","3165.2653","202062.06","0.74","0.0024","1.4672"]
[36,11,"31335.2","5.2478","3149.3619","273208.69","1.00","0.0024","1.4672"]
[37,11,"31355.5","5.2416","3145.6411","276608.66","1.01","0.0024","1.4672"]
[38,12,"33251.1","4.6623","2797.9858","421565.12","1.56","0.0015","0.9170"]
[39,12,"33294.3","4.6491","2790.0641","444005.53","1.62","0.0015","0.9170"]
[40,12,"33450.8","4.6013","2761.3779","462588.72","1.69","0.0015","0.9170"]
[41,12,"33493.6","4.5882","2753.5162","502005.69","1.84","0.0015","0.9170"]
[42,13,"33539.1","4.5743","2745.1744","80451.22","0.29","0.0064","3.8514"]
[43,13,"33546.3","4.5721","2743.8541","80844.56","0.30","0.0061","3.6680"]
[44,13,"33576.7","4.5628","2738.2729","81837.09","0.30","0.0061","3.6680"]
[45,13,"33584.3","4.5605","2736.8926","81387.88","0.30","0.0058","3.4846"]
[46,13,"33628.1","4.5471","2728.8508","31433.56","0.12","0.0034","2.0174"]
[47,14,"34494.6","4.2823","2569.9364","86204.62","0.32","0.0018","1.1004"]
[48,14,"34522.1","4.2739","2564.8953","112545.56","0.41","0.0021","1.2838"]
[49,14,"34530.6","4.2713","2563.3350","288375.78","1.05","0.0018","1.1004"]
[50,14,"34557.4","4.2631","2558.4139","306119.38","1.12","0.0021","1.2838"]
[51,14,"34566.6","4.2603","2556.7336","306227.09","1.12","0.0024","1.4672"]
[52,14,"34593.4","4.2521","2551.8125","295126.22","1.08","0.0018","1.1004"]
[53,14,"34602.3","4.2494","2550.1921","117011.09","0.43","0.0021","1.2838"]
[54,14,"34629.4","4.2411","2545.2111","90267.12","0.33","0.0018","1.1004"]
[55,15,"34919.3","4.1525","2492.0396","242930.03","0.89","0.0024","1.4672"]
[56,15,"34953.7","4.1420","2485.7382","275249.25","1.01","0.0024","1.4672"]
[57,15,"34966.8","4.1380","2483.3377","332724.06","1.22","0.0031","1.8340"]
[58,15,"35002.1","4.1272","2476.8563","326082.31","1.20","0.0024","1.4672"]
[59,15,"35009.3","4.1250","2475.5360","310432.84","1.14","0.0015","0.9170"]
[60,15,"35047.3","4.1134","2468.5745","274467.59","1.00","0.0015","0.9170"]
[61,15,"35085.2","4.1018","2461.6130","171692.34","0.63","0.0028","1.6506"]
[62,16,"35114.4","4.0929","2456.2718","107205.62","0.39","0.0037","2.2008"]
[63,16,"35121.9","4.0906","2454.8915","107194.53","0.39","0.0046","2.7510"]
[64,16,"35154.9","4.0805","2448.8302","113775.38","0.42","0.0046","2.7510"]
[65,16,"35171.3","4.0755","2445.8295","622379.34","2.28","0.0024","1.4672"]
[66,16,"35184.7","4.0714","2443.3690","440387.47","1.62","0.0031","1.8340"]
[67,16,"35198.8","4.0671","2440.7885","1069235.44","3.91","0.0021","1.2838"]
[68,16,"35215.8","4.0619","2437.6678","840157.97","3.08","0.0043","2.5676"]
[69,16,"35224.6","4.0592","2436.0474","707310.06","2.58","0.0028","1.6506"]
[70,16,"35240.7","4.0543","2433.1068","682306.06","2.49","0.0034","2.0174"]
[71,16,"35253.4","4.0504","2430.7663","356429.56","1.30","0.0024","1.4672"]
[72,17,"35342.8","4.0231","2414.3827","653548.91","2.39","0.0028","1.6506"]
[73,17,"35368.3","4.0153","2409.7017","977668.41","3.58","0.0018","1.1004"]
[74,17,"35382.4","4.0110","2407.1212","800910.53","2.93","0.0024","1.4672"]
[75,17,"35408.9","4.0029","2402.2601","930995.31","3.45","0.0015","0.9170"]
[76,17,"35435.7","3.9947","2397.3390","209118.56","0.76","0.0046","2.7510"]
[77,18,"35533.9","3.9647","2379.3351","3401743.12","12.55","0.0021","1.2838"]
[78,19,"35611.4","3.9410","2365.1121","414950.59","1.52","0.0037","2.2008"]
[79,19,"35627.5","3.9361","2362.1714","436798.12","1.60","0.0037","2.2008"]
[80,20,"35692.6","3.9162","2350.2288","420885.56","1.54","0.0018","1.1004"]
[81,20,"35704.0","3.9127","2348.1284","360223.41","1.33","0.0028","1.6506"]
[82,20,"35713.9","3.9097","2346.3280","683440.72","2.53","0.0024","1.4672"]
[83,20,"35739.4","3.9019","2341.6470","3127638.12","11.43","0.0024","1.4672"]
[84,20,"35759.3","3.8958","2337.9862","513714.09","1.88","0.0028","1.6506"]
[85,20,"35770.8","3.8923","2335.8857","449390.78","1.66","0.0028","1.6506"]
[86,20,"35782.9","3.8886","2333.6653","408399.69","1.51","0.0028","1.6506"]
[87,21,"35827.4","3.8750","2325.5035","120453.09","0.44","0.0018","1.1004"]
[88,21,"35845.1","3.8696","2322.2628","102212.41","0.38","0.0021","1.2838"]
[89,22,"35884.7","3.8575","2315.0012","311269.09","1.14","0.0024","1.4672"]
[90,22,"35900.7","3.8526","2312.0606","384034.03","1.40","0.0034","2.0174"]
[91,22,"35924.9","3.8452","2307.6196","140977.31","0.52","0.0040","2.3842"]
[92,22,"35937.3","3.8414","2305.3391","102962.06","0.38","0.0040","2.3842"]
[93,22,"35956.3","3.8356","2301.8584","459215.81","1.68","0.0031","1.8340"]
[94,22,"35982.8","3.8275","2296.9973","329008.72","1.21","0.0028","1.6506"]
[95,22,"36004.1","3.8210","2293.0965","223722.34","0.83","0.0018","1.1004"]
[96,22,"36039.4","3.8102","2286.6151","265074.06","0.97","0.0018","1.1004"]
[97,22,"36060.7","3.8037","2282.7142","119035.06","0.44","0.0021","1.2838"]
[98,23,"36079.0","3.7981","2279.3535","510765.12","1.90","0.0015","0.9170"]
[99,23,"36093.4","3.7937","2276.7129","481211.06","1.76","0.0021","1.2838"]
[100,23,"36109.8","3.7887","2273.7123","361300.97","1.32","0.0037","2.2008"]
[101,23,"36118.6","3.7860","2272.0919","763912.38","2.79","0.0024","1.4672"]
[102,23,"36127.1","3.7834","2270.5316","885651.66","3.24","0.0031","1.8340"]
[103,23,"36143.5","3.7784","2267.5309","673679.53","2.46","0.0031","1.8340"]
[104,23,"36161.5","3.7729","2264.2302","751283.78","2.75","0.0037","2.2008"]
[105,23,"36175.2","3.7687","2261.7097","296783.69","1.09","0.0024","1.4672"]
[106,23,"36182.8","3.7664","2260.3294","285725.25","1.05","0.0021","1.2838"]
[107,23,"36194.5","3.7628","2258.1689","558540.72","2.05","0.0031","1.8340"]
[108,23,"36207.3","3.7589","2255.8284","814941.00","3.00","0.0031","1.8340"]
[109,23,"36219.1","3.7553","2253.6679","812172.38","2.98","0.0031","1.8340"]
[110,23,"36248.5","3.7463","2248.2668","508011.25","1.86","0.0040","2.3842"]
[111,23,"36268.8","3.7401","2244.5460","505992.16","1.86","0.0028","1.6506"]
[112,23,"36279.0","3.7370","2242.6856","724125.84","2.67","0.0024","1.4672"]
[113,23,"36315.0","3.7260","2236.0841","452822.59","1.66","0.0064","3.8514"]
[114,23,"36332.3","3.7207","2232.9034","399180.75","1.46","0.0024","1.4672"]
[115,23,"36336.9","3.7193","2232.0633","368381.53","1.35","0.0018","1.1004"]
[116,23,"36345.7","3.7166","2230.4429","414285.88","1.52","0.0028","1.6506"]
[117,23,"36356.9","3.7132","2228.4025","296376.94","1.09","0.0024","1.4672"]
[118,23,"36362.1","3.7116","2227.4423","283178.16","1.04","0.0021","1.2838"]
[119,23,"36373.2","3.7082","2225.4018","444575.84","1.63","0.0034","2.0174"]
[120,23,"36399.4","3.7002","2220.6008","160720.84","0.59","0.0021","1.2838"]
[121,23,"36404.0","3.6988","2219.7606","171695.84","0.63","0.0024","1.4672"]
[122,24,"36452.4","3.6840","2210.8787","976646.59","3.57","0.0018","1.1004"]
[123,24,"36474.0","3.6774","2206.9178","974377.78","3.61","0.0015","0.9170"]
[124,24,"36503.4","3.6684","2201.5166","356823.03","1.30","0.0018","1.1004"]
[125,24,"36522.8","3.6625","2197.9759","355230.00","1.30","0.0018","1.1004"]
[126,24,"36557.8","3.6518","2191.5545","411313.91","1.52","0.0015","0.9170"]
[127,24,"36576.7","3.6460","2188.0737","399409.31","1.48","0.0018","1.1004"]
[128,25,"36648.7","3.6240","2174.8709","829780.56","3.07","0.0015","0.9170"]
[129,25,"36672.6","3.6167","2170.4899","854636.69","3.13","0.0012","0.7336"]
[130,25,"36707.3","3.6061","2164.1286","877322.47","3.21","0.0012","0.7336"]
[131,25,"36734.1","3.5979","2159.2075","843585.84","3.11","0.0015","0.9170"]
[132,26,"36831.0","3.5683","2141.4436","4556086.41","17.02","0.0015","0.9170"]
[133,27,"36865.7","3.5577","2135.0823","268467.59","0.99","0.0015","0.9170"]
[134,27,"36886.6","3.5513","2131.2414","250222.41","0.91","0.0018","1.1004"]
[135,27,"36919.7","3.5412","2125.1801","220889.91","0.81","0.0015","0.9170"]
[136,27,"36940.3","3.5349","2121.3993","225445.00","0.83","0.0015","0.9170"]
[137,28,"36965.5","3.5272","2116.7783","765153.66","2.80","0.0024","1.4672"]
[138,28,"36983.5","3.5217","2113.4776","501686.38","1.83","0.0024","1.4672"]
[139,28,"36993.6","3.5186","2111.6172","1275213.56","4.66","0.0024","1.4672"]
[140,28,"37020.1","3.5105","2106.7561","744358.53","2.73","0.0024","1.4672"]
[141,28,"37043.7","3.5033","2102.4352","1004361.25","3.68","0.0037","2.2008"]
[142,28,"37072.8","3.4944","2097.0940","334588.47","1.23","0.0037","2.2008"]
[143,28,"37093.1","3.4882","2093.3732","770407.69","2.83","0.0021","1.2838"]
[144,28,"37104.2","3.4848","2091.3328","207634.31","0.76","0.0024","1.4672"]
[145,28,"37132.4","3.4762","2086.1717","498742.91","1.82","0.0046","2.7510"]
[146,28,"37146.1","3.4720","2083.6511","332956.91","1.22","0.0028","1.6506"]
[147,28,"37157.9","3.4684","2081.4907","644136.59","2.37","0.0034","2.0174"]
[148,28,"37177.2","3.4625","2077.9499","352663.16","1.29","0.0028","1.6506"]
[149,28,"37189.3","3.4588","2075.7294","235007.88","0.86","0.0031","1.8340"]
[150,29,"37253.5","3.4392","2063.9669","561595.00","2.05","0.0037","2.2008"]
[151,29,"37290.4","3.4279","2057.1854","1082383.31","3.96","0.0037","2.2008"]
[152,29,"37296.6","3.4260","2056.0452","792354.03","2.90","0.0015","0.9170"]
[153,29,"37306.5","3.4230","2054.2448","1030637.25","3.77","0.0034","2.0174"]
[154,29,"37344.1","3.4115","2047.3433","752201.25","2.75","0.0037","2.2008"]
[155,29,"37360.1","3.4066","2044.4026","255218.75","0.93","0.0043","2.5676"]
[156,29,"37384.0","3.3993","2040.0217","245382.84","0.90","0.0034","2.0174"]
[157,29,"37393.2","3.3965","2038.3413","262002.09","0.96","0.0021","1.2838"]
[158,30,"37435.4","3.3836","2030.5996","66784.66","0.24","0.0040","2.3842"]
[159,31,"37489.4","3.3671","2020.6975","288484.34","1.06","0.0018","1.1004"]
[160,31,"37528.6","3.3551","2013.4959","547914.34","2.00","0.0021","1.2838"]
[161,31,"37552.9","3.3477","2009.0550","211253.69","0.77","0.0028","1.6506"]
[162,31,"37566.9","3.3434","2006.4744","307924.22","1.13","0.0031","1.8340"]
[163,31,"37584.3","3.3381","2003.2937","515642.56","1.88","0.0031","1.8340"]
[164,31,"37591.1","3.3360","2002.0335","441277.97","1.62","0.0018","1.1004"]
[165,31,"37628.1","3.3247","1995.2520","557884.62","2.05","0.0028","1.6506"]
[166,31,"37669.0","3.3122","1987.7504","424985.84","1.56","0.0052","3.1178"]
[167,31,"37708.6","3.3001","1980.4888","458963.34","1.68","0.0046","2.7510"]
[168,31,"37761.0","3.2841","1970.8867","531168.19","1.94","0.0034","2.0174"]
[169,32,"37790.1","3.2752","1965.5456","588592.28","2.15","0.0034","2.0174"]
[170,32,"37798.6","3.2726","1963.9852","612856.75","2.24","0.0024","1.4672"]
[171,32,"37841.5","3.2595","1956.1235","693041.94","2.53","0.0024","1.4672"]
[172,32,"37849.3","3.2571","1954.6832","497915.19","1.82","0.0021","1.2838"]
[173,32,"37870.6","3.2506","1950.7824","355208.62","1.30","0.0034","2.0174"]
[174,33,"37908.2","3.2391","1943.8809","719683.22","2.63","0.0028","1.6506"]
[175,34,"37986.8","3.2151","1929.4778","624418.44","2.29","0.0034","2.0174"]
[176,34,"38071.8","3.1891","1913.8744","344657.72","1.26","0.0034","2.0174"]
[177,35,"38583.3","3.0328","1820.0741","1653177.88","6.05","0.0024","1.4672"]
[178,35,"38624.2","3.0203","1812.5724","2087954.41","7.64","0.0046","2.7510"]
[179,35,"38666.1","3.0075","1804.8908","1720482.38","6.33","0.0021","1.2838"]
[180,36,"38765.9","2.9770","1786.5868","351264.34","1.29","0.0018","1.1004"]
[181,36,"38789.8","2.9697","1782.2059","369265.16","1.35","0.0018","1.1004"]
[182,36,"38857.8","2.9489","1769.7232","742458.44","2.74","0.0018","1.1004"]
[183,36,"38881.7","2.9416","1765.3422","714647.75","2.62","0.0018","1.1004"]
[184,37,"39013.3","2.9014","1741.2170","723629.34","2.67","0.0021","1.2838"]
[185,37,"39053.5","2.8891","1733.8354","713490.88","2.61","0.0018","1.1004"]
[186,37,"39105.2","2.8733","1724.3533","347617.69","1.28","0.0015","0.9170"]
[187,37,"39145.8","2.8609","1716.9117","350307.06","1.29","0.0018","1.1004"]
[188,38,"39231.9","2.8346","1701.1283","449997.66","1.66","0.0015","0.9170"]
[189,38,"39252.8","2.8282","1697.2875","467574.06","1.72","0.0018","1.1004"]
[190,38,"39327.1","2.8055","1683.6645","739543.47","2.74","0.0015","0.9170"]
[191,38,"39348.0","2.7991","1679.8237","718504.75","2.66","0.0015","0.9170"]
[192,39,"39604.9","2.7206","1632.7135","9979684.94","36.81","0.0015","0.9170"]
[193,40,"39651.7","2.7063","1624.1316","738978.09","2.70","0.0018","1.1004"]
[194,40,"39700.8","2.6913","1615.1297","452700.66","1.66","0.0018","1.1004"]
[195,40,"39746.9","2.6772","1606.6679","451911.75","1.66","0.0015","0.9170"]
[196,41,"40002.5","2.5991","1559.7977","52000.44","0.19","0.0015","0.9170"]
[197,42,"40310.7","2.5049","1503.2655","85296.56","0.31","0.0024","1.4672"]
[198,42,"40348.4","2.4934","1496.3640","106370.88","0.39","0.0028","1.6506"]
[199,42,"40359.2","2.4901","1494.3835","106080.59","0.39","0.0028","1.6506"]
[200,43,"40385.3","2.4821","1489.5825","190541.81","0.70","0.0018","1.1004"]
[201,43,"40394.8","2.4792","1487.8421","429096.91","1.58","0.0028","1.6506"]
[202,44,"40432.5","2.4677","1480.9406","454305.69","1.66","0.0028","1.6506"]
[203,44,"40443.9","2.4642","1478.8402","708916.09","2.60","0.0031","1.8340"]
[204,44,"40468.5","2.4567","1474.3392","579832.75","2.12","0.0028","1.6506"]
[205,44,"40483.2","2.4522","1471.6386","834751.50","3.06","0.0034","2.0174"]
[206,44,"40492.7","2.4493","1469.8982","517445.06","1.89","0.0024","1.4672"]
[207,44,"40507.1","2.4449","1467.2577","576529.41","2.13","0.0024","1.4672"]
[208,44,"40517.9","2.4416","1465.2772","594139.56","2.20","0.0028","1.6506"]
[209,44,"40530.0","2.4379","1463.0568","555781.88","2.05","0.0031","1.8340"]
[210,44,"40552.2","2.4311","1458.9759","547719.06","2.03","0.0015","0.9170"]
[211,44,"40567.9","2.4263","1456.0953","124827.00","0.46","0.0031","1.8340"]
[212,44,"40576.8","2.4236","1454.4749","122664.19","0.45","0.0024","1.4672"]
[213,44,"40601.6","2.4160","1449.9139","149045.81","0.55","0.0018","1.1004"]
[214,44,"40613.7","2.4123","1447.6934","116664.34","0.43","0.0031","1.8340"]
[215,44,"40635.7","2.4056","1443.6726","117727.72","0.43","0.0015","0.9170"]
[216,45,"40704.4","2.3846","1431.0698","93986.47","0.34","0.0021","1.2838"]
[217,45,"40744.3","2.3724","1423.7483","183880.69","0.67","0.0034","2.0174"]
[218,45,"40752.2","2.3700","1422.3079","117635.19","0.43","0.0018","1.1004"]
[219,45,"40781.0","2.3612","1417.0268","164861.22","0.60","0.0043","2.5676"]
[220,45,"40792.7","2.3576","1414.8663","176206.75","0.64","0.0031","1.8340"]
[221,45,"40814.0","2.3511","1410.9655","247854.28","0.91","0.0028","1.6506"]
[222,45,"40824.5","2.3479","1409.0451","165656.78","0.61","0.0040","2.3842"]
[223,45,"40852.9","2.3392","1403.8239","116386.22","0.43","0.0031","1.8340"]
[224,45,"40861.5","2.3366","1402.2636","237580.94","0.87","0.0024","1.4672"]
[225,45,"40899.1","2.3251","1395.3621","78199.34","0.29","0.0028","1.6506"]
[226,45,"40918.4","2.3192","1391.8213","23200.00","0.08","0.0037","2.2008"]
[227,46,"40943.9","2.3114","1387.1403","17506.16","0.06","0.0037","2.2008"]
[228,46,"40957.7","2.3072","1384.6198","69200.44","0.25","0.0024","1.4672"]
[229,46,"40981.5","2.2999","1380.2388","73496.25","0.27","0.0028","1.6506"]
[230,46,"40995.9","2.2955","1377.5983","172977.03","0.64","0.0024","1.4672"]
[231,46,"41019.8","2.2882","1373.2173","177239.53","0.65","0.0031","1.8340"]
[232,46,"41034.2","2.2838","1370.5767","237852.28","0.88","0.0024","1.4672"]
[233,46,"41057.8","2.2766","1366.2558","235679.22","0.87","0.0021","1.2838"]
[234,46,"41072.2","2.2722","1363.6152","188762.59","0.69","0.0024","1.4672"]
[235,46,"41096.1","2.2649","1359.2343","180271.38","0.66","0.0024","1.4672"]
[236,46,"41110.5","2.2605","1356.5937","82368.06","0.30","0.0031","1.8340"]
[237,46,"41134.4","2.2532","1352.2128","75784.34","0.28","0.0028","1.6506"]
[238,47,"41329.7","2.1935","1316.3850","47429.62","0.17","0.0018","1.1004"]
[239,48,"41368.7","2.1816","1309.2435","77896.47","0.28","0.0021","1.2838"]
[240,48,"41376.2","2.1793","1307.8632","83583.28","0.31","0.0021","1.2838"]
[241,48,"41389.6","2.1752","1305.4026","882534.44","3.23","0.0015","0.9170"]
[242,48,"41400.4","2.1719","1303.4222","162042.31","0.59","0.0012","0.7336"]
[243,48,"41408.9","2.1693","1301.8619","338837.84","1.25","0.0040","2.3842"]
[244,48,"41429.5","2.1630","1298.0810","1712586.34","6.26","0.0018","1.1004"]
[245,48,"41438.7","2.1602","1296.4007","609364.31","2.23","0.0024","1.4672"]
[246,48,"41455.7","2.1550","1293.2800","384979.41","1.41","0.0031","1.8340"]
[247,48,"41470.1","2.1506","1290.6394","1182118.69","4.38","0.0034","2.0174"]
[248,48,"41487.8","2.1452","1287.3987","595583.47","2.19","0.0037","2.2008"]
[249,48,"41510.7","2.1382","1283.1978","317538.25","1.16","0.0028","1.6506"]
[250,48,"41524.1","2.1341","1280.7373","599833.84","2.20","0.0024","1.4672"]
[251,48,"41559.8","2.1232","1274.1959","242938.62","0.89","0.0034","2.0174"]
[252,49,"41591.2","2.1136","1268.4346","49894.88","0.18","0.0024","1.4672"]
[253,49,"41602.3","2.1102","1266.3942","81209.75","0.30","0.0024","1.4672"]
[254,49,"41629.8","2.1018","1261.3531","91757.22","0.34","0.0024","1.4672"]
[255,49,"41639.3","2.0989","1259.6127","53127.19","0.19","0.0024","1.4672"]
[256,49,"41665.4","2.0909","1254.8117","211934.62","0.77","0.0037","2.2008"]
[257,49,"41706.0","2.0785","1247.3701","284524.28","1.04","0.0037","2.2008"]
[258,49,"41741.0","2.0678","1240.9487","242056.62","0.89","0.0037","2.2008"]
[259,49,"41772.8","2.0581","1235.1274","193832.50","0.71","0.0052","3.1178"]
[260,49,"41785.2","2.0543","1232.8469","112407.38","0.41","0.0021","1.2838"]
[261,49,"41800.9","2.0495","1229.9663","133477.00","0.49","0.0031","1.8340"]
[262,49,"41808.1","2.0473","1228.6460","139587.47","0.51","0.0031","1.8340"]
[263,49,"41832.3","2.0399","1224.2051","177125.81","0.65","0.0031","1.8340"]
[264,49,"41869.3","2.0286","1217.4236","334388.06","1.22","0.0031","1.8340"]
[265,49,"41906.0","2.0174","1210.7021","402389.16","1.48","0.0034","2.0174"]
[266,49,"41932.1","2.0094","1205.9011","307847.75","1.13","0.0043","2.5676"]
[267,49,"41943.9","2.0058","1203.7406","301452.72","1.10","0.0040","2.3842"]
[268,49,"41982.5","1.9940","1196.6591","266679.44","0.97","0.0037","2.2008"]
[269,49,"42021.8","1.9820","1189.4575","201458.66","0.74","0.0037","2.2008"]
[270,49,"42036.5","1.9775","1186.7569","235375.78","0.86","0.0040","2.3842"]
[271,49,"42045.7","1.9747","1185.0766","244320.34","0.89","0.0034","2.0174"]
[272,49,"42058.8","1.9707","1182.6761","89025.91","0.33","0.0024","1.4672"]
[273,49,"42077.1","1.9651","1179.3153","137087.84","0.50","0.0067","4.0348"]
[274,49,"42109.5","1.9552","1173.3740","56634.34","0.21","0.0034","2.0174"]
[275,49,"42121.6","1.9515","1171.1536","76998.72","0.28","0.0046","2.7510"]
[276,49,"42134.4","1.9476","1168.8131","37802.00","0.14","0.0028","1.6506"]
[277,49,"42154.3","1.9415","1165.1523","167964.91","0.62","0.0031","1.8340"]
[278,49,"42187.0","1.9315","1159.1510","199312.59","0.73","0.0049","2.9344"]
[279,49,"42211.6","1.9240","1154.6500","199609.12","0.73","0.0055","3.3012"]
[280,49,"42244.3","1.9140","1148.6487","181852.31","0.66","0.0037","2.2008"]
[281,49,"42276.7","1.9041","1142.7074","81931.12","0.30","0.0037","2.2008"]
[282,49,"42321.9","1.8903","1134.4256","36724.78","0.13","0.0037","2.2008"]
[283,49,"42354.9","1.8802","1128.3643","20530.78","0.08","0.0058","3.4846"]
[284,50,"42710.0","1.7717","1063.2502","28638.38","0.10","0.0064","3.8514"]
[285,50,"42747.6","1.7602","1056.3487","55690.88","0.20","0.0043","2.5676"]
[286,50,"42780.6","1.7501","1050.2874","399265.19","1.46","0.0031","1.8340"]
[287,50,"42821.9","1.7375","1042.7258","878915.84","3.22","0.0070","4.2182"]
[288,50,"42864.1","1.7246","1034.9841","1356709.88","4.97","0.0052","3.1178"]
[289,50,"42906.3","1.7117","1027.2424","902303.41","3.30","0.0070","4.2182"]
[290,50,"42948.2","1.6989","1019.5607","426985.16","1.57","0.0028","1.6506"]
[291,51,"43005.1","1.6815","1009.1185","69643.50","0.26","0.0046","2.7510"]
[292,51,"43038.5","1.6713","1002.9972","87218.97","0.32","0.0052","3.1178"]
[293,51,"43065.0","1.6632","998.1361","68570.66","0.25","0.0046","2.7510"]
[294,51,"43076.1","1.6598","996.0957","76796.47","0.28","0.0043","2.5676"]
[295,51,"43097.7","1.6532","992.1348","73164.38","0.27","0.0052","3.1178"]
[296,51,"43114.4","1.6481","989.0741","54769.62","0.20","0.0037","2.2008"]
[297,51,"43135.0","1.6418","985.2933","62944.94","0.23","0.0034","2.0174"]
[298,51,"43151.4","1.6368","982.2927","23606.09","0.09","0.0040","2.3842"]
[299,51,"43171.3","1.6307","978.6319","41700.22","0.15","0.0037","2.2008"]
[300,52,"43271.1","1.6002","960.3279","27228.84","0.10","0.0028","1.6506"]
[301,52,"43283.6","1.5964","958.0474","34837.69","0.13","0.0034","2.0174"]
[302,52,"43292.7","1.5936","956.3671","136746.94","0.51","0.0018","1.1004"]
[303,52,"43310.1","1.5883","953.1864","39875.69","0.15","0.0037","2.2008"]
[304,52,"43333.3","1.5812","948.9255","529293.16","1.94","0.0018","1.1004"]
[305,52,"43373.6","1.5689","941.5439","966492.22","3.53","0.0018","1.1004"]
[306,52,"43413.8","1.5566","934.1623","940171.34","3.46","0.0018","1.1004"]
[307,52,"43454.1","1.5443","926.7807","493454.22","1.83","0.0015","0.9170"]
[308,52,"43494.3","1.5320","919.3991","114472.84","0.42","0.0015","0.9170"]
[309,53,"43560.7","1.5117","907.2164","61088.53","0.22","0.0031","1.8340"]
[310,53,"43601.0","1.4994","899.8348","405247.09","1.49","0.0040","2.3842"]
[311,53,"43618.3","1.4941","896.6541","3038073.31","11.11","0.0018","1.1004"]
[312,53,"43642.6","1.4867","892.2132","756174.56","2.76","0.0037","2.2008"]
[313,53,"43657.9","1.4820","889.3926","3138979.12","11.58","0.0018","1.1004"]
[314,53,"43682.5","1.4745","884.8916","827948.28","3.03","0.0058","3.4846"]
[315,53,"43703.7","1.4680","880.9907","542977.16","1.98","0.0046","2.7510"]
[316,53,"43716.5","1.4641","878.6502","543458.16","1.99","0.0034","2.0174"]
[317,53,"43726.3","1.4611","876.8498","736389.09","2.69","0.0046","2.7510"]
[318,53,"43742.7","1.4561","873.8492","670558.59","2.45","0.0031","1.8340"]
[319,53,"43765.6","1.4491","869.6483","526552.34","1.93","0.0028","1.6506"]
[320,53,"43781.3","1.4443","866.7677","282937.69","1.03","0.0028","1.6506"]
[321,53,"43806.2","1.4367","862.2067","39587.62","0.15","0.0049","2.9344"]
[322,54,"44108.8","1.3442","806.6947","3115763.00","11.50","0.0018","1.1004"]
[323,54,"44119.0","1.3411","804.8343","2095962.03","7.76","0.0021","1.2838"]
[324,54,"44144.8","1.3332","800.0932","3110442.31","11.41","0.0018","1.1004"]
[325,54,"44157.0","1.3295","797.8727","1952064.88","7.23","0.0018","1.1004"]
[326,55,"44190.0","1.3194","791.8114","17877.66","0.07","0.0012","0.7336"]
[327,55,"44194.3","1.3181","791.0313","14363.97","0.05","0.0012","0.7336"]
[328,55,"44198.2","1.3169","790.3111","11844.97","0.04","0.0012","0.7336"]
[329,55,"44231.6","1.3067","784.1898","62139.56","0.23","0.0021","1.2838"]
[330,55,"44250.5","1.3009","780.7090","10593.25","0.04","0.0012","0.7336"]
[331,55,"44272.1","1.2943","776.7482","202871.78","0.75","0.0021","1.2838"]
[332,55,"44282.3","1.2912","774.8878","80728.38","0.30","0.0021","1.2838"]
[333,55,"44312.4","1.2820","769.3666","242369.03","0.89","0.0034","2.0174"]
[334,55,"44322.9","1.2788","767.4462","213608.28","0.78","0.0028","1.6506"]
[335,55,"44346.1","1.2717","763.1852","194125.25","0.71","0.0028","1.6506"]
[336,55,"44352.6","1.2697","761.9850","154357.53","0.56","0.0018","1.1004"]
[337,55,"44363.1","1.2665","760.0646","229259.03","0.85","0.0031","1.8340"]
[338,55,"44386.0","1.2595","755.8637","189540.28","0.70","0.0031","1.8340"]
[339,55,"44396.8","1.2562","753.8832","189269.75","0.69","0.0040","2.3842"]
[340,55,"44426.3","1.2472","748.4821","77911.50","0.28","0.0024","1.4672"]
[341,55,"44436.7","1.2440","746.5616","169248.38","0.62","0.0024","1.4672"]
[342,55,"44461.3","1.2365","742.0607","21202.31","0.08","0.0034","2.0174"]
[343,55,"44476.3","1.2319","739.3001","63870.94","0.23","0.0021","1.2838"]
[344,55,"44496.9","1.2256","735.5192","16272.09","0.06","0.0031","1.8340"]
[345,55,"44511.3","1.2212","732.8787","11006.12","0.04","0.0021","1.2838"]
[346,56,"45059.8","1.0536","632.2969","2750824.62","10.07","0.0018","1.1004"]
[347,56,"45098.1","1.0419","625.2754","2679479.22","9.90","0.0021","1.2838"]
[348,56,"45166.1","1.0211","612.7927","3139881.50","11.52","0.0018","1.1004"]
[349,56,"45204.4","1.0094","605.7712","3139900.47","11.47","0.0018","1.1004"]
[350,56,"45223.1","1.0037","602.3504","2859787.94","10.53","0.0021","1.2838"]
[351,56,"45261.3","0.9920","595.3289","2743840.75","10.03","0.0018","1.1004"]
[352,57,"45378.8","0.9561","573.7842","1520703.50","5.59","0.0021","1.2838"]
[353,57,"45419.4","0.9437","566.3426","3104352.62","11.39","0.0018","1.1004"]
[354,57,"45459.6","0.9314","558.9610","1343390.62","4.92","0.0018","1.1004"]
[355,57,"45522.5","0.9122","547.4385","1333040.31","4.87","0.0012","0.7336"]
[356,57,"45563.0","0.8998","539.9969","2544946.81","9.48","0.0015","0.9170"]
[357,57,"45603.3","0.8875","532.6153","1240524.47","4.53","0.0015","0.9170"]
{"$rows_empty":89}
[{"$nulls":25},"x"]
[{"$nulls":25},"x"]
[{"$nulls":25},"x"]
[{"$nulls":25},"x"]
[{"$nulls":25},"x"]
[{"$nulls":25},"x"]
[{"$nulls":25},"x"]
[{"$nulls":25},"x"]
[{"$nulls":10},"|=> you can insert new rows here",{"$nulls":14},"x"]
[{"$nulls":25},"x"]
["proton nmr peaks + sat",{"$nulls":24},"x"]
["peak index","region","index (F1)","ν (F1) [ppm]","ν (F1) [Hz]","intensity [abs]","intensity [rel]","half width [ppm]","half width [Hz]","annotation",{"$nulls":15},"x"]
[{"$nulls":10},"|=> leave unused rows empty",{"$nulls":14},"x"]
[{"$nulls":25},"x"]
[{"$nulls":25},"x"]
[{"$nulls":25},"x"]
[{"$nulls":25},"x"]
[{"$nulls":25},"x"]
[{"$nulls":25},"x"]
[{"$nulls":25},"x"]
[{"$nulls":25},"x"]
[{"$nulls":25},"x"]
[{"$nulls":25},"x"]
[{"$nulls":25},"x"]
[{"$nulls":25},"x"]
[{"$nulls":10},"|=> you can insert new rows here",{"$nulls":14},"x"]
[{"$nulls":25},"x"]
["multiplet",null,null,"use \";\" as separator","[ppm1 .. ppm2]",{"$nulls":20},"x"]
["ν (F1) [ppm]","H's","type","J(Hz)","range (ppm)","atoms","MSI level",{"$nulls":18},"x"]
[{"$nulls":7},"|=> leave unused rows empty",{"$nulls":17},"x"]
[{"$nulls":7},"|=> MSI level: used for biomatrix (later)",{"$nulls":17},"x"]
[{"$nulls":7},"NOTE:  if completed, image of the molecule with atom number attribution",{"$nulls":17},"x"]
[{"$nulls":25},"x"]
[{"$nulls":25},"x"]
[{"$nulls":25},"x"]
[{"$nulls":25},"x"]
[{"$nulls":25},"x"]
[{"$nulls":25},"x"]
[{"$nulls":7},"|=> you can insert new rows here",{"$nulls":17},"x"]
[{"$nulls":25},"x"]
[{"$nulls":25},"x"]
[{"$nulls":25},"x"]
[{"$nulls":25},"x"]
[{"$nulls":25},"x"]
[{"$nulls":25},"x"]
[{"$nulls":25},"x"]
[{"$nulls":25},"x"]
[{"$nulls":25},"x"]
[{"$nulls":25},"x"]
[{"$nulls":25},"x"]
[{"$nulls":25},"x"]
[{"$nulls":25},"x"]
[{"$nulls":25},"x"]
[{"$nulls":25},"x"]
[{"$nulls":25},"x"]
[{"$nulls":25},"x"]
[{"$nulls":25},"x"]
[{"$nulls":25},"x"]
[{"$nulls":25},"x"]
[{"$nulls":25},"x"]
[{"$nulls":25},"x"]
[{"$nulls":25},"x"]
[{"$nulls":25},"x"]
[{"$nulls":25},"x"]
[{"$nulls":25},"x"]
[{"$nulls":25},"x"]
[{"$nulls":25},"x"]
[{"$nulls":25},"x"]
[{"$nulls":25},"x"]
[{"$nulls":25},"x"]
[{"$nulls":25},"x"]
[{"$nulls":25},"x"]
[{"$nulls":25},"x"]
[{"$nulls":25},"x"]
[{"$nulls":25},"x"]
[{"$nulls":25},"x"]
[{"$nulls":25},"x"]
[{"$nulls":25},"x"]
[{"$nulls":25},"x"]
[{"$nulls":25},"x"]
[{"$nulls":25},"x"]
[{"$nulls":25},"x"]
[{"$nulls":25},"x"]
[{"$nulls":25},"x"]
[{"$nulls":25},"x"]
[{"$nulls":25},"x"]
[{"$nulls":25},"x"]
[{"$nulls":25},"x"]
[{"$nulls":25},"x"]
[{"$nulls":25},"x"]
[{"$nulls":25},"x"]
["x","x","x","x","x","x","x","x","x","x","x","x","x","x","x","x","x","x","x","x","x","x","x","x","x","x"]

{"sheet":"other","index":17,"n_rows":100,"n_cols":26,"rows_kept":100}
["data author(s)","MetaToul-AXIOM","|=> enter your lab. / plateforme name",{"$nulls":22},"x"]
["data validator(s)","CANLET","|=> name of the personne who checked all data in this file",{"$nulls":22},"x"]
["acquisition date","2017-10-27","|=> format: \"2014-02-20\"",{"$nulls":22},"x"]
["data ownership","MetaToul-AXIOM","|=> enter your lab. / plateforme name & sample provider;",{"$nulls":22},"x"]
["license/copyright",{"$nulls":24},"x"]
["other license",{"$nulls":24},"x"]
[{"$nulls":25},"x"]
["raw file name","MTH-Alanine-2D","|=> needed to retrive file later",{"$nulls":22},"x"]
["raw file size (Ko)",null,"|=> optional, to check if the file is correct",{"$nulls":22},"x"]
[{"$nulls":25},"x"]
[{"$nulls":25},"x"]
[{"$nulls":25},"x"]
[{"$nulls":25},"x"]
[{"$nulls":25},"x"]
[{"$nulls":25},"x"]
[{"$nulls":25},"x"]
[{"$nulls":25},"x"]
["template_spec","nmr",{"$nulls":23},"x"]
["template_version","2.0.0",{"$nulls":23},"x"]
["template_status","dev",{"$nulls":23},"x"]
[{"$nulls":25},"x"]
["Notes:","this template has been released on 2016/10/20;",{"$nulls":23},"x"]
["Warning:","this is NOT the final version: work in progress!",{"$nulls":23},"x"]
[{"$nulls":25},"x"]
[{"$nulls":25},"x"]
[{"$nulls":25},"x"]
[{"$nulls":25},"x"]
[{"$nulls":25},"x"]
[{"$nulls":25},"x"]
[{"$nulls":25},"x"]
[{"$nulls":25},"x"]
[{"$nulls":25},"x"]
[{"$nulls":25},"x"]
[{"$nulls":25},"x"]
[{"$nulls":25},"x"]
[{"$nulls":25},"x"]
[{"$nulls":25},"x"]
[{"$nulls":25},"x"]
[{"$nulls":25},"x"]
[{"$nulls":25},"x"]
[{"$nulls":25},"x"]
[{"$nulls":25},"x"]
[{"$nulls":25},"x"]
[{"$nulls":25},"x"]
[{"$nulls":25},"x"]
[{"$nulls":25},"x"]
[{"$nulls":25},"x"]
[{"$nulls":25},"x"]
[{"$nulls":25},"x"]
[{"$nulls":25},"x"]
[{"$nulls":25},"x"]
[{"$nulls":25},"x"]
[{"$nulls":25},"x"]
[{"$nulls":25},"x"]
[{"$nulls":25},"x"]
[{"$nulls":25},"x"]
[{"$nulls":25},"x"]
[{"$nulls":25},"x"]
[{"$nulls":25},"x"]
[{"$nulls":25},"x"]
[{"$nulls":25},"x"]
[{"$nulls":25},"x"]
[{"$nulls":25},"x"]
[{"$nulls":25},"x"]
[{"$nulls":25},"x"]
[{"$nulls":25},"x"]
[{"$nulls":25},"x"]
[{"$nulls":25},"x"]
[{"$nulls":25},"x"]
[{"$nulls":25},"x"]
[{"$nulls":25},"x"]
[{"$nulls":25},"x"]
[{"$nulls":25},"x"]
[{"$nulls":25},"x"]
[{"$nulls":25},"x"]
[{"$nulls":25},"x"]
[{"$nulls":25},"x"]
[{"$nulls":25},"x"]
[{"$nulls":25},"x"]
[{"$nulls":25},"x"]
[{"$nulls":25},"x"]
[{"$nulls":25},"x"]
[{"$nulls":25},"x"]
[{"$nulls":25},"x"]
[{"$nulls":25},"x"]
[{"$nulls":25},"x"]
[{"$nulls":25},"x"]
[{"$nulls":25},"x"]
[{"$nulls":25},"x"]
[{"$nulls":25},"x"]
[{"$nulls":25},"x"]
[{"$nulls":25},"x"]
[{"$nulls":25},"x"]
[{"$nulls":25},"x"]
[{"$nulls":25},"x"]
[{"$nulls":25},"x"]
[{"$nulls":25},"x"]
[{"$nulls":25},"x"]
[{"$nulls":25},"x"]
["x","x","x","x","x","x","x","x","x","x","x","x","x","x","x","x","x","x","x","x","x","x","x","x","x","x"]

{"sheet":"validation","index":18,"n_rows":25,"n_cols":3,"rows_kept":25}
["analytical sample"]
[null,"sample solvent",{"$f":"IF(analytical_sample!B4=\"\",\"MISSING VALUE\",\"ok\")","v":"ok"}]
[null,"sample pH or sample apparent pH",{"$f":"IF((analytical_sample!B5=\"\")*(analytical_sample!B4<>form_data!D11),\"MISSING VALUE\",\"ok\")","v":"ok"}]
[null,"reference chemical shif indicator",{"$f":"IF(analytical_sample!B6=\"\",\"MISSING VALUE\",\"ok\")","v":"ok"}]
[null,"compound InChIKey",{"$f":"IF(analytical_sample!B1=form_data!A2,IF(analytical_sample!B20=\"\",\"MISSING VALUE\",\"ok\"),IF(analytical_sample!B20=\"\",\"-\",\"ignored\"))","v":"MISSING VALUE"}]
[null,"bio matrix source",{"$f":"IF(analytical_sample!B1=form_data!A4,IF(analytical_sample!#REF!=\"\",\"MISSING VALUE\",\"ok\"),IF(analytical_sample!B20=\"\",\"-\",\"ignored\"))","v":"-"}]
[null,"bio matrix type",{"$f":"IF(analytical_sample!B1=form_data!A4,IF(analytical_sample!B47=\"\",\"MISSING VALUE\",\"ok\"),IF(analytical_sample!B20=\"\",\"-\",\"ignored\"))","v":"-"}]
[]
["chromatography"]
[null,"column length (mm)",{"$f":"IF(chromatography!B24=\"\",\"MISSING VALUE\",\"ok\")","v":"MISSING VALUE"}]
[null,"column diameter (mm)",{"$f":"IF(chromatography!B25=\"\",\"MISSING VALUE\",\"ok\")","v":"MISSING VALUE"}]
[null,"particule size (µm)",{"$f":"IF(chromatography!B26=\"\",\"MISSING VALUE\",\"ok\")","v":"MISSING VALUE"}]
[]
["MS analyzer"]
[null,"???"]
[]
["NMR analyser"]
[null,"magnetic field strenght (MHz)",{"$f":"IF(NMR_analyzer!B3=\"\",\"MISSING VALUE\",\"ok\")","v":"ok"}]
[null,"NMR probe",{"$f":"IF(NMR_analyzer!B5=\"\",\"MISSING VALUE\",\"ok\")","v":"ok"}]
[null,"cell or tube",{"$f":"IF(NMR_analyzer!B6=\"\",\"MISSING VALUE\",\"ok\")","v":"ok"}]
[null,"NMR tube diameter (mm)",{"$f":"IF(NMR_analyzer!B6<>form_data!H127,IF(NMR_analyzer!B7=\"\",\"MISSING VALUE\",\"ok\"),IF(NMR_analyzer!B7=\"\",\"-\",\"ignored\"))","v":"ok"}]
[null,"flow cell volume (µl)",{"$f":"IF(NMR_analyzer!B6<>form_data!H128,IF(NMR_analyzer!B8=\"\",\"MISSING VALUE\",\"ok\"),IF(NMR_analyzer!B8=\"\",\"-\",\"ignored\"))","v":"-"}]
[]
["other"]
[null,"data author(s)",{"$f":"IF(other!B1=\"\",\"MISSING VALUE\",\"ok\")","v":"ok"}]

{"sheet":"form_data","index":19,"n_rows":172,"n_cols":12,"rows_kept":172,"hidden":true}
["sample_type","bio_matrix_source","bio_matrix_type","lock_substance","chromatography_type","GC_methods","LC_methods","magnetic_field_strength","MS commercial name","ms_level","identification","copyright"]
["chemical library compound (single)",null,null,"D2O","none"]
["chemical library compounds mix","Homo sapiens","blood","H2O/D2O","GC",null,"NA",400,"Thermo","ms","Unknown compounds","CC - by - sa"]
["standardized matrix","Mus musculus","plasma","MeOD/D2O","LC","GC_mode","API-MS procedure Bordeaux",500,"Bruker","ms2","Putatively characterized compound classes","CC - by -nc - sa"]
["analytical matrix (biological)","Rattus Norvegicus","urine","CDCl3",null,null,"LTQ-Orbitrap procedure Bordeaux",600,"Waters","ms3","Putatively annotated compounds","Copyright"]
[null,"Saccharomyces cerevisiae","muscle tissue","acetone-d6","-","Gradient","CF_plasma method 1_POS (API-MS procedure_Clermont Ferrand)",700,"Agilent",null,"Confident identifications","other"]
["centrifugation",null,"brain tissue",null,null,"Isocratique","CF_plasma method 2_POS (API-MS procedure_Clermont Ferrand)",750,"PE biosystem","polarity"]
["yes","Arabidopsis thaliana","liver tissue","solvant",null,null,"CF_plasma method 1_NEG (API-MS procedure_Clermont Ferrand)",800,"Sciex",null,null,"template_status"]
["no","Solanum lycopersicum",null,"H2O",null,"GC_column_constructor","CF_plasma method 2_NEG (API-MS procedure_Clermont Ferrand)",850,"Shimadzu","positive"]
[null,"Vitis","plant","H2O/D2O",null,null,"CF_plasma method 3_POS (API-MS procedure_Clermont Ferrand)",900,null,"negative",null,"dev"]
["MS - solvent",null,"fruit","CDCl3",null,"AGILENT","CF_plasma method 3_NEG (API-MS procedure_Clermont Ferrand)",950,{"$nulls":3},"alpha"]
[null,"Escherichia coli","fruit body","D2O",null,"HPINTERCHIM","CF_urine method_POS (API-MS procedure_Clermont Ferrand)",1000,null,"ionization_mode",null,"beta"]
["none","Pseudomonas","fruit capsule","CD3OD",null,"J&W scientific","CF_urine method_NEG (API-MS procedure_Clermont Ferrand)",1200,{"$nulls":3},"release_candidate"]
["H2O",null,"fruit peduncule",null,null,"OV","IDF_Plasma-FIA-OrbitrapPos (API-MS procedures - IDF-upmc)",null,null,"ACPI",null,"stable"]
["H2O/ACN (50/50) + 0.1% AF","other species","fruit juice","buffer_solution",null,"VARIAN","IDF_Plasma-FIA-OrbitrapNeg (API-MS procedures - IDF-upmc)","model",null,"APPI",null," "]
["ACN/H2O (1/1, v/v)",null,"exocarp","potassium phosphate",null,"other","IDF_Urine-LC-OrbitrapPos (API-MS procedures - IDF-upmc)",null,null,"EI"]
["CH3OH/H2O (1/1, v/v)",null,"sorocarp","deuterated potassium phosphate",null,null,"IDF_Plasma-LC-OrbitrapPos (API-MS procedures - IDF-upmc)","Avance I",null,"ESI"]
["H2O/ACN (40/60)",null,"pulp","sodium phosphate",null,"GC_column_name","IDF_Tissue-FIA-OrbitrapPos  (API-MS procedures - IDF-upmc)","Avance II",null,"FAB"]
["H2O/ACN (95/5)",null,null,"potassium and sodium phosphate",null,"free","IDF_Tissue-FIA-OrbitrapNeg  (API-MS procedures - IDF-upmc)","Avance III",null,"MALDI"]
["10% ACN + 0.1% FA",null,"biofilm","oxalate",null,null,"IDF (API-MS procedures_HILICneg_IDF)",null,null,"Unknown"]
[{"$nulls":3},"NaOD, DCl",null,null,"IDF (API-MS procedures_HILICpos_IDF)","dimensions"]
["carbon 13 isotopic labelling",null,"other source",{"$nulls":3},"IDF (API-MS procedures_PFPPneg_IDF)",null,null,"resolution","curation"]
[null,null,"unknown source","reference_chemical_shif_indicator",null,null,"IDF (API-MS procedures_PFPPpos_IDF)","1D",null,"low","no curation"]
["no",null,null,"TSP",null,null,"IDF (API-MS procedures_RPC18neg_IDF)","JRES",null,"high","peaks RI > 1%"]
["yes",null,null,"TMS",null,null,"IDF (API-MS procedures_RPC18pos_IDF)","2D",null,null,"top 50 peaks"]
[{"$nulls":3},"glucose",null,null,"IDF (API-MS procedures_RPC8neg_IDF)",null,null,"NCE energy unit","top 20 peaks"]
[{"$nulls":3},"other",null,null,"IDF (API-MS procedures_RPC8pos_IDF)","nuclear_type_d1",null,null,"top 10 peaks"]
[{"$nulls":6},"MetaToul Tissue ESI+ (API-MS procedures_Toulouse-MetaToul)",null,null,"normalized","similar chromatographic profile"]
[{"$nulls":3},"-",null,null,"MetaToul Tissue ESI- (API-MS procedures_Toulouse-MetaToul)","H",null,"real"]
[{"$nulls":6},"MetaToul Cells ESI+ (API-MS procedures_Toulouse-MetaToul)","C"]
[{"$nulls":3},"cpd-mix solvent",null,null,"MetaToul Cells ESI- (API-MS procedures_Toulouse-MetaToul)","N",null,"qtof frag. Enery unit"]
[{"$nulls":7},"P"]
[{"$nulls":3},"H2O/Ethanol (75/25)",{"$nulls":5},"normalized"]
[{"$nulls":7},"nuclear_type_d2",null,"eV"]
[{"$nulls":3},"std-matrix"]
[{"$nulls":3},"NIST plasma",null,null,"LC_mode","H",null,"ion storage gas"]
[{"$nulls":7},"C"]
[{"$nulls":6},"Gradient","N",null,"He"]
[{"$nulls":6},"Isocratic","P",null,"N2"]
[{"$nulls":9},"Ar"]
[{"$nulls":6},"LC_column_constructor","software_name"]
[]
[{"$nulls":6},"Agilent","TopSpin"]
[{"$nulls":6},"Alltech"]
[{"$nulls":6},"CIL Cluzeau","software_version"]
[{"$nulls":6},"Daicel","TopSpin 2.1"]
[{"$nulls":6},"Hypersil","TopSpin 3.0"]
[{"$nulls":6},"Interchim","TopSpin 3.1",null,"ion gas pressure"]
[{"$nulls":6},"Macherey Nagel","TopSpin 3.2"]
[{"$nulls":6},"Merck","TopSpin 3.5",null,"mbar"]
[{"$nulls":6},"Phenomenex",null,null,"a.u."]
[{"$nulls":6},"Shiseido"]
[{"$nulls":6},"Supelco (Sigma-Aldrich)",null,null,"Resonant excitation amplitude (Vpp or %)"]
[{"$nulls":6},"Thermo"]
[{"$nulls":6},"Vydac",null,null,"Vpp"]
[{"$nulls":6},"Waters","probe",null,"%"]
[{"$nulls":6},"YMC"]
[{"$nulls":6},"other","Cryo-TXI",null,"Collision voltage "]
[{"$nulls":7},"BBI"]
[{"$nulls":6},"Phases mobiles","BBFO",null,"V"]
[{"$nulls":7},"BBO",null,"%"]
[{"$nulls":6},"5% ACN + 0.1% FA in H2O","TXI"]
[{"$nulls":6},"10% ACN + 0.1% FA in H2O","PH FISEI"]
[{"$nulls":6},"10mM (NH4)2CO3 / ACN (20/80) (v/v)","HRMAS"]
[{"$nulls":6},"Acetonitrile","DUAL"]
[{"$nulls":6},"Acetonitrile + 0.1% Formic Acid","Cryo-DUAL"]
[{"$nulls":6},"H2O + 0.1% Formic Acid","TXO"]
[{"$nulls":6},"H2O, ammonium carbonate 10 mM, pH10.5","CQPCI"]
[{"$nulls":6},"H2O, ammonium acetate 2.5 mM","CPTCI"]
[{"$nulls":6},"H2O / CH3OH / CH3CO2H (95/5/0.1)","LC-RMN"]
[{"$nulls":6},"Methanol"]
[{"$nulls":6},"Methanol / H2O (1/1)"]
[{"$nulls":6},"Methanol / H2O (1/1), 0.1% FA"]
[{"$nulls":6},"Methanol / CH3CO2H (100/0.1)"]
[{"$nulls":6},"Methanol / ACN (60/40) ammonium acetate 2.5 mM","experiment_number"]
[{"$nulls":7},"free"]
[]
[{"$nulls":7},"pulse_sequence"]
[]
[{"$nulls":7},"zg"]
[{"$nulls":7},"noesygppr1d"]
[{"$nulls":7},"zgpr"]
[{"$nulls":7},"jresgpprqf"]
[{"$nulls":7},"cosygpprqf"]
[{"$nulls":7},"hsqcetgp"]
[{"$nulls":7},"hmqcphpr"]
[]
[{"$nulls":7},"pulse_angle"]
[]
[{"$nulls":7},90]
[{"$nulls":7},"30-90"]
[]
[{"$nulls":7},"relaxation_delay"]
[{"$nulls":7},"free"]
[]
[{"$nulls":7},"number_of_points"]
[]
[{"$nulls":7},"8192(F2)*32(F1)"]
[{"$nulls":7},"4096(F2)*512(F1)"]
[{"$nulls":7},"4096(F2)*256(F1)"]
[]
[{"$nulls":7},"number_of_scans"]
[]
[{"$nulls":7},8]
[{"$nulls":7},16]
[{"$nulls":7},32]
[{"$nulls":7},48]
[{"$nulls":7},64]
[{"$nulls":7},"4k"]
[{"$nulls":7},"10k"]
[]
[{"$nulls":7},"expected_result"]
[]
[{"$nulls":7},"Water suppression"]
[{"$nulls":7},"Multiplicity of protons and coupling constant J (Hz)"]
[{"$nulls":7},"Coupling proton-proton"]
[{"$nulls":7},"Coupling proton-carbone"]
[]
[{"$nulls":7},"NMR_tube_diameter"]
[]
[{"$nulls":7},"1.7"]
[{"$nulls":7},3]
[{"$nulls":7},5]
[]
[{"$nulls":7},"cell_or_tube"]
[]
[{"$nulls":7},"cell"]
[{"$nulls":7},"tube"]
[]
[{"$nulls":7},"BOOLEAN"]
[]
[{"$nulls":7},"yes"]
[{"$nulls":7},"no"]
[]
[{"$nulls":7},"true "]
[{"$nulls":7},"false "]
[]
[{"$nulls":7},"SI"]
[]
[{"$nulls":7},"16k"]
[{"$nulls":7},"32k"]
[{"$nulls":7},"64k"]
[{"$nulls":7},"128k"]
[]
[{"$nulls":7},"Window Functions"]
[]
[{"$nulls":7},"no"]
[{"$nulls":7},"EM"]
[{"$nulls":7},"SINE"]
[{"$nulls":7},"QSINE"]
[{"$nulls":7},"GM"]
[{"$nulls":7},"other"]
[]
[{"$nulls":7},"peak picking"]
[]
[{"$nulls":7},"manual"]
[{"$nulls":7},"automatic"]
[]
[{"$nulls":7},"SI (2D)"]
[]
[{"$nulls":7},64]
[{"$nulls":7},128]
[{"$nulls":7},256]
[{"$nulls":7},512]
[{"$nulls":7},1024]
[{"$nulls":7},2048]
[{"$nulls":7},"4096"]
[{"$nulls":7},"8192"]
[{"$nulls":7},"16k"]
[{"$nulls":7},"32k"]
[{"$nulls":7},"64k"]
[{"$nulls":7},"128k"]

{"sheet":"database_data","index":20,"n_rows":3,"n_cols":4,"rows_kept":3,"hidden":true}
["analytical matrix "]
[null,"description","key","isFav"]
[null,"","",""]

{"sheet":"MS_help","index":21,"n_rows":49,"n_cols":9,"rows_kept":49,"hidden":true}
{"$rows_empty":37}
[{"$nulls":8},"ion collision activation"]
[null,null,"Tandem type "," Activation cell"," Activation mode","Particularly name","Energy unit"]
[null,1,"QqQ/MS","q","NR","CID","eV"]
[null,2,"QqIT/MS","q or IT","NR or R","CID"," eV (meV)"]
[null,3,"Qq/TO/MS","q","NR","CID","eV"]
[null,4,"IT/TOF/MS","IT","R","CID","meV"]
[null,5,"Q/IM/Coll Cell/TOF/MS","q or IM","NR","CID"," eV"]
[null,6,"TOF/TOF/MS","coll. cell","NR","CID"," eV"]
[null,7,"Q -exactive MS","hexapole","NR","HCD","%"]
[null,8,"LTQ-OrbitrapMS","IT/Hexapole","R or NR "," CID/HCD","%"]
[null,9,"Fusion","Hex/LTQ","R or NR"," CID/HCD","%"]
[null,10,"Qh/ICR","Hex/ICR","NR or R","CID/(SORI/CID)","eV/ (meV/eV)"]