{"text_format":"3","workbook":"xlsx","n_sheets":22,"sheets":["analytical_sample","chromatography","MS_analyzer","MS_peaks","NMR_peaks_all","NMR_analyzer","NMR_peaks_H1D","NMR_peaks_C1D","JRES","COSY","NOESY","TOCSY","HSQC","HMBC","carbon-13-1D_acquisition","CPMG-1D_acquisition","NOESY-1D_acquisition","other","validation","form_data","database_data","MS_help"],"not_rendered":{"images":3,"macros":1,"defined_names":1},"read":"whole","date_system":"1900"}

{"sheet":"analytical_sample","index":0,"n_rows":99,"n_cols":10,"rows_kept":99,"merged":[[2,0,2,1],[13,0,13,1],[18,0,18,1],[28,0,43,0],[48,0,63,0]]}
["sample type","chemical library compound (single)",{"$nulls":7},"x"]
[{"$nulls":9},"x"]
["NMR tube preparation",{"$nulls":8},"/!\\ nmr only"]
["solvent","D2O","Mandatory","|=> choose in list",{"$nulls":5},"/!\\ nmr only"]
["sample pH or sample apparent pH",7,"Mandatory if aqueous solvant",{"$nulls":6},"/!\\ nmr only"]
["reference chemical shif indicator","TSP","Optional","|=> choose in list",{"$nulls":5},"/!\\ nmr only"]
["reference chemical shif indicator (other)",null,"Optional",{"$nulls":6},"/!\\ nmr only"]
["reference concentration (mmol/L)",1,"Optional",{"$nulls":6},"/!\\ nmr only"]
["lock substance","D2O","Optional","|=> choose in list",{"$nulls":5},"/!\\ nmr only"]
["lock substance concentration (volumic %)",100,"Optional",{"$nulls":6},"/!\\ nmr only"]
["buffer solution","potassium and sodium phosphate","Optional","|=> choose in list",{"$nulls":5},"/!\\ nmr only"]
["buffer solution concentration (mmol/L)",200,"Optional",{"$nulls":6},"/!\\ nmr only"]
[{"$nulls":9},"/!\\ nmr only"]
["Isotopic Labelling",{"$nulls":8},"/!\\ nmr only"]
["Deuterium Isotopic Labelling","no","Optional","|=> choose in list",{"$nulls":5},"/!\\ nmr only"]
{"$rows_left_out":85}
{"sheet":"chromatography","index":1,"n_rows":50,"n_cols":10,"rows_kept":50,"hidden":true,"merged":[[2,0,2,1],[6,0,6,1],[18,0,18,3],[33,0,40,0]]}
["chromatography","LC",{"$nulls":7},"x"]
[{"$nulls":9},"x"]
["No Chromatography",{"$nulls":8},"x"]
["analysis volume (ml)",{"$nulls":8},"x"]
["sample weight (mg)",{"$nulls":8},"x"]
[{"$nulls":9},"x"]
["Gaz Chromatography",{"$nulls":8},"x"]
["Method",{"$nulls":8},"x"]
["Column constructor",{"$nulls":8},"x"]
["Column name",{"$nulls":8},"x"]
["Column length (m)",{"$nulls":8},"x"]
["Column diameter (mm)",{"$nulls":8},"x"]
["Particule size (µm)",{"$nulls":8},"x"]
["Year of purchase",{"$nulls":8},"x"]
["Injection volume (µL)",{"$nulls":8},"x"]
{"$rows_left_out":36}
{"sheet":"MS_analyzer","index":2,"n_rows":120,"n_cols":26,"rows_kept":120,"hidden":true,"merged":[[0,0,0,1],[8,4,8,5],[8,10,8,11],[10,11,11,11],[10,12,11,12],[16,9,16,10],[17,13,17,14],[17,15,17,16],[17,17,17,18],[17,19,18,19]]}
["Analyzer",{"$nulls":22},"x",null,"x"]
["analyzer type",null,"|=> Ion analyzer types are \"B\", \"E\", \"FT\" (inculde other types using FT like FTICR or Orbitrap), \"IT\", \"Q\", \"TOF\" (e.g.: \"QTOF\", \"QQQ\", \"EB\", \"ITFT\")*",{"$nulls":20},"x",null,"x"]
["manufacturer brands",null,null,"*for further informations please refer to MassBank Record documentation: ",{"$nulls":19},"x",null,"x"]
["|--- empty ---","|--- empty ---"]
["Detector",{"$nulls":24},"x"]
["Detection protocol",{"$nulls":24},"x"]
[{"$nulls":3},"http://www.massbank.jp/manuals/MassBankRecord_en.pdf",{"$nulls":19},"x",null,"x"]
["Molecule ionization","mode pos","mode neg",{"$nulls":20},"x",null,"x"]
["Ionization method",null,null,"|=> choose in list","Ion storage: Ion trap (IT) and ICR",{"$nulls":5},"Ion beam: q or h collision Cell (QqQ, QqIT, Qq/TOF, Fusion)",{"$nulls":12},"x"]
["High voltage (ESI) /                 Corona voltage (APCI)",null,null,"|=> in kV","Gas",null,null,"|=> i f FT/ICR in SORI-CID ",null,null,"Gas",{"$nulls":12},"x"]
["Spray (needle) gaz flow",null,null,"|=> arbitrary in Xcalibur","Gas pressure (mbar or a.u.)",null,null,"|=> if FT-/CR in SORI-CID & IT\n(optional field)",null,null,"Gas pressure",{"$nulls":12},"x"]
["Vaporizer temperature",null,null,"|=> in °C","Frequency shift (KHz)",null,null,"|=> if FT/ICR in SORI-CID ",null,null,"(mbar or a.u.)",{"$nulls":12},"x",null,"x"]
["Source gas flow",null,null,"|=> arbitrary in Xcalibur","Ion number (AGC or ICC)",null,null,"|=> if IT",{"$nulls":15},"x",null,"x"]
["Vaporizer gas flow",null,null,"|=> arbitrary in Xcalibur",{"$nulls":19},"x",null,"x"]
["Ion transfer tube temperature / Transfer capillary temperature",null,null,"|=> in °C",{"$nulls":19},"x",null,"x"]
{"$rows_left_out":106}
{"sheet":"MS_peaks","index":3,"n_rows":100,"n_cols":27,"rows_kept":100,"hidden":true,"merged":[[4,0,5,0],[6,0,7,0]]}
["scan type","ms",{"$nulls":3},"Curation","no curation",null,"identified compound",{"$nulls":17},"x"]
["polarity",{"$nulls":7},"identified compound",{"$nulls":17},"x"]
["frag. energy (eV)*",{"$nulls":25},"x"]
["parent ion mass*",{"$nulls":25},"x"]
["mass range","from","to",{"$nulls":23},"x"]
[{"$nulls":26},"x"]
["retention time","from (min)","to (min)","from (%CH3OH)","to (%CH3OH)",{"$nulls":21},"x"]
[{"$nulls":26},"x"]
[{"$nulls":26},"x"]
["m/z","absolute intensity","relative intensity (%)","theo. mass","delta (ppm)","RDB equiv","composition","attribution","putative cpd name","putative cpd inchikey","identification level*",null,"*cf Sumner et al, \"Proposed quantitative and alphanumeric metabolite identification metrics\", Metabolomics (2014) ",{"$nulls":13},"x"]
[{"$nulls":10},"Confident identifications",null,"DOI 10.1007/s11306-014-0739-6",{"$nulls":13},"x"]
[{"$nulls":10},"Confident identifications",{"$nulls":15},"x"]
[{"$nulls":10},"Confident identifications",{"$nulls":15},"x"]
[{"$nulls":10},"Confident identifications",{"$nulls":15},"x"]
[{"$nulls":10},"Confident identifications",{"$nulls":15},"x"]
{"$rows_left_out":86}
{"sheet":"NMR_peaks_all","index":4,"n_rows":72,"n_cols":11,"rows_kept":72,"hidden":true}
["proton nmr peaks"]
["peak index","region","index (F1)","ν (F1) [ppm]","ν (F1) [Hz]","intensity [abs]","intensity [rel]","half width [ppm]","half width [Hz]","annotation"]
[{"$nulls":10},"|=> leave unused rows empty"]
{"$rows_empty":13}
[{"$nulls":10},"|=> you can insert new rows here"]
[]
["proton nmr peaks + sat"]
["peak index","region","index (F1)","ν (F1) [ppm]","ν (F1) [Hz]","intensity [abs]","intensity [rel]","half width [ppm]","half width [Hz]","annotation"]
[{"$nulls":10},"|=> leave unused rows empty"]
{"$rows_empty":12}
[{"$nulls":10},"|=> you can insert new rows here"]
[]
["multiplet",null,null,"use \",\" as separator","[ppm1 .. ppm2]"]
["ν (F1) [ppm]","H's","type","J(Hz)","range (ppm)","atoms","MSI level"]
[{"$nulls":7},"|=> leave unused rows empty"]
{"$rows_left_out":35}
{"sheet":"NMR_analyzer","index":5,"n_rows":177,"n_cols":10,"rows_kept":177,"merged":[[11,0,11,1],[21,0,21,1],[32,0,32,1],[44,0,44,1],[56,0,56,1],[70,0,70,1],[85,0,85,1],[101,0,101,1],[117,0,117,1],[135,0,135,1]]}
["Instrument",{"$nulls":8},"x"]
["Instrument name","Avance III","Optional","|=> choose in list",{"$nulls":5},"x"]
["Magnetic field strength (MHz)",600,"Mandatory","|=> choose in list",{"$nulls":5},"x"]
["Software","TopSpin 3.2","Optional","|=> choose in list",{"$nulls":5},"x"]
["NMR probe","CQPCI","Mandatory","|=> choose in list",{"$nulls":5},"x"]
["Cell or Tube","tube","Mandatory","|=> choose in list",{"$nulls":5},"x"]
["NMR tube diameter (mm)",5,"Mandatory if Tube","|=> choose in list",{"$nulls":5},"x"]
["Flow cell volume (µl)","","Mandatory if Cell",{"$nulls":6},"x"]
[{"$nulls":9},"x"]
["NOTE: in a futur release of this file, you could choose the acquisition.",null,null,"WARNING: mandatory / optional fields are still in discussion",{"$nulls":5},"x"]
[{"$nulls":6},"hint: also know in topsin as value…","label in file \"acqu\" with prefix",null,"x"]
["Proton acquisition (1D)",null,null,"Spectra processing parameters",{"$nulls":5},"x"]
["Pulse sequence",null,"Mandatory","Fourier transform","true ",null,"PULPROG","##$PULPROG =<…>",null,"x"]
["Pulse angle (°)",null,"Optional","SI",null,"|=> choose in list","F1","?",null,"x"]
["Number of points",null,"Optional","Line broadening",null,null,"TD","##$TD",null,"x"]
{"$rows_left_out":163}
{"sheet":"NMR_peaks_H1D","index":6,"n_rows":100,"n_cols":26,"rows_kept":100,"hidden":true}
["proton nmr peaks",{"$nulls":24},"x"]
["peak index","region","index (F1)","ν (F1) [ppm]","ν (F1) [Hz]","intensity [abs]","intensity [rel]","half width [ppm]","half width [Hz]","annotation",{"$nulls":15},"x"]
[{"$nulls":10},"|=> leave unused rows empty",{"$nulls":14},"x"]
[{"$nulls":25},"x"]
[{"$nulls":25},"x"]
[{"$nulls":25},"x"]
[{"$nulls":25},"x"]
[{"$nulls":25},"x"]
[{"$nulls":25},"x"]
[{"$nulls":25},"x"]
[{"$nulls":25},"x"]
[{"$nulls":25},"x"]
[{"$nulls":25},"x"]
[{"$nulls":25},"x"]
[{"$nulls":25},"x"]
{"$rows_left_out":86}
{"sheet":"NMR_peaks_C1D","index":7,"n_rows":100,"n_cols":26,"rows_kept":100,"hidden":true}
["carbon",{"$nulls":24},"x"]
["peak index","region","index (F1)","ν (F1) [ppm]","ν (F1) [Hz]","intensity [abs]","intensity [rel]","half width [ppm]","half width [Hz]","annotation",{"$nulls":15},"x"]
[{"$nulls":10},"|=> leave unused rows empty",{"$nulls":14},"x"]
[{"$nulls":25},"x"]
[{"$nulls":25},"x"]
[{"$nulls":25},"x"]
[{"$nulls":25},"x"]
[{"$nulls":25},"x"]
[{"$nulls":25},"x"]
[{"$nulls":10},"|=> you can insert new rows here",{"$nulls":14},"x"]
[{"$nulls":25},"x"]
["multiplet","(if C-H and/or C-C coupling)",null,"use \",\" as separator","[ppm1 .. ppm2]",{"$nulls":20},"x"]
["ν (F1) [ppm]","C's","type","J(Hz)","range (ppm)","atoms","MSI level",{"$nulls":18},"x"]
[{"$nulls":7},"|=> leave unused rows empty",{"$nulls":17},"x"]
[{"$nulls":7},"|=> MSI level: used for biomatrix (later)",{"$nulls":17},"x"]
{"$rows_left_out":86}
{"sheet":"JRES","index":8,"n_rows":509,"n_cols":27,"rows_kept":509}
["JRES correlations",{"$nulls":4},"use \";\" as separator",{"$nulls":20},"x"]
["peak index","ν (F2) [ppm]","ν (F1) [ppm]","intensity [rel]","multiplicity","J (coupling constant)","annotation",{"$nulls":19},"x"]
[1,"0.9001","-0.0122","67435270.00",null,null,3,{"$nulls":19},"x"]
[2,"0.9004","-0.0005","137886444.00",null,null,2]
[3,"0.9004","0.0122","67435270.00",null,null,2]
[4,"0.9434","-0.0123","51800516.00",null,null,2]
[6,"0.9442","0.0122","51078020.00",null,null,2]
[5,"0.9445","0.0000","117285896.00"]
[7,"0.9977","-0.0060","104211480.00"]
[8,"0.9983","0.0059","103062752.00"]
[10,"1.0149","0.0056","116188552.00"]
[9,"1.0151","-0.0061","116188552.00"]
[11,"1.0486","-0.0059","97217820.00"]
[12,"1.0494","0.0058","82514638.00"]
[18,"1.2681","0.0251","4846952.00"]
{"$rows_left_out":321}
{"sheet":"COSY","index":9,"n_rows":300,"n_cols":26,"rows_kept":300}
["1H-1H  COSY NMR correlations",{"$nulls":24},"x"]
["peak index","ν (F2) [ppm]","ν (F1) [ppm]","intensity [rel]","annotation",{"$nulls":20},"x"]
[103,"0.9019","1.5635","459412.00",{"$nulls":21},"x"]
[101,"0.9454","1.2612","1898512.00"]
[102,"0.9468","1.4697","1498772.00"]
[100,"0.9958","2.2619","6164352.00"]
[98,"1.0165","1.9596","4643288.00"]
[99,"1.0489","2.2723","3077632.00"]
[107,"1.2346","0.9381","3747992.00"]
[104,"1.2684","1.4801","5282696.00"]
[105,"1.2732","1.9909","4438988.00"]
[106,"1.3015","0.9485","4298648.00"]
[96,"1.3360","4.1277","3559912.00"]
[108,"1.3388","2.1159","2402104.00"]
[97,"1.3443","4.2423","21085820.00"]
{"$rows_left_out":195}
{"sheet":"NOESY","index":10,"n_rows":100,"n_cols":26,"rows_kept":100,"hidden":true}
["1H-1H  NOESY NMR correlations",{"$nulls":24},"x"]
["peak index","ν (F2) [ppm]","ν (F1) [ppm]","intensity [rel]","annotation",{"$nulls":20},"x"]
[{"$nulls":25},"x"]
[{"$nulls":25},"x"]
[{"$nulls":25},"x"]
[{"$nulls":25},"x"]
[{"$nulls":25},"x"]
[{"$nulls":25},"x"]
[{"$nulls":25},"x"]
[{"$nulls":25},"x"]
[{"$nulls":25},"x"]
[{"$nulls":25},"x"]
[{"$nulls":25},"x"]
[{"$nulls":25},"x"]
[{"$nulls":25},"x"]
{"$rows_left_out":86}
{"sheet":"TOCSY","index":11,"n_rows":515,"n_cols":26,"rows_kept":515}
["1H-1H TOCSY NMR correlations",{"$nulls":24},"x"]
["peak index","ν (F2) [ppm]","ν (F1) [ppm]","intensity [rel]","annotation",{"$nulls":20},"x"]
[1,3.7915,1.4891,14896086,"2;3",{"$nulls":20},"x"]
[2,3.7915,3.7859,6191420,"2;2",{"$nulls":20},"x"]
[3,1.4861,1.4821,1689458,"3;3",{"$nulls":20},"x"]
[4,1.4869,3.7859,6801484,"3;2",{"$nulls":20},"x"]
{"$rows_empty":415}
[{"$nulls":25},"x"]
[{"$nulls":25},"x"]
[{"$nulls":25},"x"]
[{"$nulls":25},"x"]
[{"$nulls":25},"x"]
[{"$nulls":25},"x"]
[{"$nulls":25},"x"]
[{"$nulls":25},"x"]
{"$rows_left_out":87}
{"sheet":"HSQC","index":12,"n_rows":204,"n_cols":26,"rows_kept":204}
["1H-13C HSQC NMR correlations",{"$nulls":24},"x"]
["peak index","ν (F2) (1H) [ppm]  ","ν (F1) (13C) [ppm]","intensity [rel]","annotation",{"$nulls":20},"x"]
[2,"0.8999","16.0523","2905649.75",{"$nulls":21},"x"]
[1,"0.9437","13.9434","4238211.50"]
[4,"0.9980","19.5009","187395.75"]
[3,"1.0160","17.4913","742931.25"]
[5,"1.0485","20.7414","403646.12"]
[8,"1.2692","27.2224","744979.25"]
[7,"1.3359","22.9187","660824.50"]
[6,"1.3393","22.2392","1368335.12"]
[13,"1.4557","19.4879","111020.25"]
[14,"1.4564","21.9300","612709.00"]
[10,"1.4740","25.4259","2246007.00"]
[11,"1.4777","27.1741","872664.62"]
[9,"1.4885","19.0464","603767.75"]
{"$rows_left_out":182}
{"sheet":"HMBC","index":13,"n_rows":582,"n_cols":26,"rows_kept":582}
["1H-13C HMBC NMR correlations",{"$nulls":24},"x"]
["peak index","ν (F2) (1H) [ppm]  ","ν (F1) (13C) [ppm]","intensity [rel]","annotation",{"$nulls":20},"x"]
[2,"0.7939","16.0692","556228.62",{"$nulls":21},"x"]
[1,"0.8345","13.7835","571653.00",{"$nulls":21},"x"]
[4,"0.8885","19.1861","262295.12",{"$nulls":21},"x"]
[5,"0.8895","22.0952","248995.25"]
[6,"0.8989","42.2510","2611817.00"]
[3,"0.9068","17.5238","575773.62"]
[7,"0.9434","38.7186","4903522.25"]
[8,"0.9449","26.9437","4454064.50"]
[10,"0.9989","31.5844","2381685.50"]
[9,"1.0013","20.5714","3052196.38"]
[21,"1.0102","62.4167","5083706.62"]
[11,"1.0142","38.5800","3398182.62"]
[12,"1.0157","27.0822","1970468.75"]
{"$rows_left_out":284}
{"sheet":"carbon-13-1D_acquisition","index":14,"n_rows":348,"n_cols":26,"rows_kept":348}
["carbon",{"$nulls":24},"x"]
["peak index","region","index (F1)","ν (F1) [ppm]","ν (F1) [Hz]","intensity [abs]","intensity [rel]","half width [ppm]","half width [Hz]","annotation",{"$nulls":15},"x"]
[1,1,"9707.1","186.9264","28207.6385","556043.15","2.01","0.0109","1.6506",{"$nulls":16},"x"]
[2,2,"10136.5","185.3609","27971.4008","355065.70","1.24","0.0073","1.1004",{"$nulls":16},"x"]
[3,3,"11346.6","180.9487","27305.5893","559790.98","1.96","0.0073","1.1004"]
[4,3,"11475.3","180.4794","27234.7708","569243.26","2.00","0.0146","2.2008"]
[5,3,"11488.8","180.4303","27227.3615","999648.83","3.59","0.0036","0.5502"]
[6,4,"11689.7","179.6977","27116.8104","755855.17","2.66","0.0073","1.1004"]
[7,4,"11950.9","178.7453","26973.0910","589203.11","2.14","0.0073","1.1004"]
[8,5,"12257.1","177.6288","26804.6085","653703.00","2.37","0.0073","1.1004"]
[9,5,"12297.4","177.4820","26782.4560","1684376.26","5.91","0.0036","0.5502"]
[10,5,"12320.0","177.3996","26770.0217","1038972.02","3.79","0.0109","1.6506"]
[11,5,"12351.1","177.2863","26752.9244","425439.56","1.52","0.0109","1.6506"]
[12,5,"12384.0","177.1663","26734.8162","600464.22","2.18","0.0109","1.6506"]
[13,5,"12391.0","177.1408","26730.9681","775790.97","2.85","0.0073","1.1004"]
{"$rows_left_out":205}
{"sheet":"CPMG-1D_acquisition","index":15,"n_rows":466,"n_cols":26,"rows_kept":466}
["proton nmr peaks",{"$nulls":24},"x"]
["peak index","region","index (F1)","ν (F1) [ppm]","ν (F1) [Hz]","intensity [abs]","intensity [rel]","half width [ppm]","half width [Hz]","annotation",{"$nulls":15},"x"]
[1,1,"22158.5","8.0522","4832.3663","995120.38","3.64","0.0018","1.1004",{"$nulls":16},"x"]
[2,1,"22164.4","8.0504","4831.2860","1013430.62","3.70","0.0018","1.1004",{"$nulls":16},"x"]
[3,2,"22847.3","7.8417","4706.0389","624458.25","2.28","0.0015","0.9170",{"$nulls":16},"x"]
[4,2,"22852.2","7.8402","4705.1387","714243.84","2.62","0.0034","2.0174",{"$nulls":16},"x"]
[5,2,"22891.2","7.8283","4697.9972","838050.94","3.08","0.0024","1.4672",{"$nulls":16},"x"]
[6,2,"22898.7","7.8260","4696.6169","674763.66","2.47","0.0018","1.1004"]
[7,3,"23168.0","7.7437","4647.2262","541356.03","1.99","0.0040","2.3842"]
[8,3,"23211.5","7.7304","4639.2444","579867.72","2.12","0.0037","2.2008"]
[9,4,"23452.7","7.6567","4595.0149","82412.22","0.30","0.0015","0.9170"]
[10,4,"23458.9","7.6548","4593.8746","152791.06","0.56","0.0021","1.2838"]
[11,4,"23465.1","7.6529","4592.7344","93615.78","0.34","0.0018","1.1004"]
[12,4,"23490.3","7.6452","4588.1134","124807.84","0.46","0.0015","0.9170"]
[13,4,"23499.5","7.6424","4586.4330","428250.59","1.57","0.0024","1.4672"]
{"$rows_left_out":438}
{"sheet":"NOESY-1D_acquisition","index":16,"n_rows":540,"n_cols":26,"rows_kept":540}
["proton nmr peaks",{"$nulls":24},"x"]
["peak index","region","index (F1)","ν (F1) [ppm]","ν (F1) [Hz]","intensity [abs]","intensity [rel]","half width [ppm]","half width [Hz]","annotation",{"$nulls":15},"x"]
[1,1,"22158.5","8.0522","4832.3663","995120.38","3.64","0.0018","1.1004",{"$nulls":16},"x"]
[2,1,"22164.4","8.0504","4831.2860","1013430.62","3.70","0.0018","1.1004",{"$nulls":16},"x"]
[3,2,"22847.3","7.8417","4706.0389","624458.25","2.28","0.0015","0.9170",{"$nulls":16},"x"]
[4,2,"22852.2","7.8402","4705.1387","714243.84","2.62","0.0034","2.0174",{"$nulls":16},"x"]
[5,2,"22891.2","7.8283","4697.9972","838050.94","3.08","0.0024","1.4672",{"$nulls":16},"x"]
[6,2,"22898.7","7.8260","4696.6169","674763.66","2.47","0.0018","1.1004"]
[7,3,"23168.0","7.7437","4647.2262","541356.03","1.99","0.0040","2.3842"]
[8,3,"23211.5","7.7304","4639.2444","579867.72","2.12","0.0037","2.2008"]
[9,4,"23452.7","7.6567","4595.0149","82412.22","0.30","0.0015","0.9170"]
[10,4,"23458.9","7.6548","4593.8746","152791.06","0.56","0.0021","1.2838"]
[11,4,"23465.1","7.6529","4592.7344","93615.78","0.34","0.0018","1.1004"]
[12,4,"23490.3","7.6452","4588.1134","124807.84","0.46","0.0015","0.9170"]
[13,4,"23499.5","7.6424","4586.4330","428250.59","1.57","0.0024","1.4672"]
{"$rows_left_out":438}
{"sheet":"other","index":17,"n_rows":100,"n_cols":26,"rows_kept":100}
["data author(s)","MetaToul-AXIOM","|=> enter your lab. / plateforme name",{"$nulls":22},"x"]
["data validator(s)","CANLET","|=> name of the personne who checked all data in this file",{"$nulls":22},"x"]
["acquisition date","2017-10-27","|=> format: \"2014-02-20\"",{"$nulls":22},"x"]
["data ownership","MetaToul-AXIOM","|=> enter your lab. / plateforme name & sample provider;",{"$nulls":22},"x"]
["license/copyright",{"$nulls":24},"x"]
["other license",{"$nulls":24},"x"]
[{"$nulls":25},"x"]
["raw file name","MTH-Alanine-2D","|=> needed to retrive file later",{"$nulls":22},"x"]
["raw file size (Ko)",null,"|=> optional, to check if the file is correct",{"$nulls":22},"x"]
[{"$nulls":25},"x"]
[{"$nulls":25},"x"]
[{"$nulls":25},"x"]
[{"$nulls":25},"x"]
[{"$nulls":25},"x"]
[{"$nulls":25},"x"]
{"$rows_left_out":86}
{"sheet":"validation","index":18,"n_rows":25,"n_cols":3,"rows_kept":25}
["analytical sample"]
[null,"sample solvent",{"$f":"IF(analytical_sample!B4=\"\",\"MISSING VALUE\",\"ok\")","v":"ok"}]
[null,"sample pH or sample apparent pH",{"$f":"IF((analytical_sample!B5=\"\")*(analytical_sample!B4<>form_data!D11),\"MISSING VALUE\",\"ok\")","v":"ok"}]
[null,"reference chemical shif indicator",{"$f":"IF(analytical_sample!B6=\"\",\"MISSING VALUE\",\"ok\")","v":"ok"}]
[null,"compound InChIKey",{"$f":"IF(analytical_sample!B1=form_data!A2,IF(analytical_sample!B20=\"\",\"MISSING VALUE\",\"ok\"),IF(analytical_sample!B20=\"\",\"-\",\"ignored\"))","v":"MISSING VALUE"}]
[null,"bio matrix source",{"$f":"IF(analytical_sample!B1=form_data!A4,IF(analytical_sample!#REF!=\"\",\"MISSING VALUE\",\"ok\"),IF(analytical_sample!B20=\"\",\"-\",\"ignored\"))","v":"-"}]
[null,"bio matrix type",{"$f":"IF(analytical_sample!B1=form_data!A4,IF(analytical_sample!B47=\"\",\"MISSING VALUE\",\"ok\"),IF(analytical_sample!B20=\"\",\"-\",\"ignored\"))","v":"-"}]
[]
["chromatography"]
[null,"column length (mm)",{"$f":"IF(chromatography!B24=\"\",\"MISSING VALUE\",\"ok\")","v":"MISSING VALUE"}]
[null,"column diameter (mm)",{"$f":"IF(chromatography!B25=\"\",\"MISSING VALUE\",\"ok\")","v":"MISSING VALUE"}]
[null,"particule size (µm)",{"$f":"IF(chromatography!B26=\"\",\"MISSING VALUE\",\"ok\")","v":"MISSING VALUE"}]
[]
["MS analyzer"]
[null,"???"]
{"$rows_left_out":11}
{"sheet":"form_data","index":19,"n_rows":172,"n_cols":12,"rows_kept":172,"hidden":true}
["sample_type","bio_matrix_source","bio_matrix_type","lock_substance","chromatography_type","GC_methods","LC_methods","magnetic_field_strength","MS commercial name","ms_level","identification","copyright"]
["chemical library compound (single)",null,null,"D2O","none"]
["chemical library compounds mix","Homo sapiens","blood","H2O/D2O","GC",null,"NA",400,"Thermo","ms","Unknown compounds","CC - by - sa"]
["standardized matrix","Mus musculus","plasma","MeOD/D2O","LC","GC_mode","API-MS procedure Bordeaux",500,"Bruker","ms2","Putatively characterized compound classes","CC - by -nc - sa"]
["analytical matrix (biological)","Rattus Norvegicus","urine","CDCl3",null,null,"LTQ-Orbitrap procedure Bordeaux",600,"Waters","ms3","Putatively annotated compounds","Copyright"]
[null,"Saccharomyces cerevisiae","muscle tissue","acetone-d6","-","Gradient","CF_plasma method 1_POS (API-MS procedure_Clermont Ferrand)",700,"Agilent",null,"Confident identifications","other"]
["centrifugation",null,"brain tissue",null,null,"Isocratique","CF_plasma method 2_POS (API-MS procedure_Clermont Ferrand)",750,"PE biosystem","polarity"]
["yes","Arabidopsis thaliana","liver tissue","solvant",null,null,"CF_plasma method 1_NEG (API-MS procedure_Clermont Ferrand)",800,"Sciex",null,null,"template_status"]
["no","Solanum lycopersicum",null,"H2O",null,"GC_column_constructor","CF_plasma method 2_NEG (API-MS procedure_Clermont Ferrand)",850,"Shimadzu","positive"]
[null,"Vitis","plant","H2O/D2O",null,null,"CF_plasma method 3_POS (API-MS procedure_Clermont Ferrand)",900,null,"negative",null,"dev"]
["MS - solvent",null,"fruit","CDCl3",null,"AGILENT","CF_plasma method 3_NEG (API-MS procedure_Clermont Ferrand)",950,{"$nulls":3},"alpha"]
[null,"Escherichia coli","fruit body","D2O",null,"HPINTERCHIM","CF_urine method_POS (API-MS procedure_Clermont Ferrand)",1000,null,"ionization_mode",null,"beta"]
["none","Pseudomonas","fruit capsule","CD3OD",null,"J&W scientific","CF_urine method_NEG (API-MS procedure_Clermont Ferrand)",1200,{"$nulls":3},"release_candidate"]
["H2O",null,"fruit peduncule",null,null,"OV","IDF_Plasma-FIA-OrbitrapPos (API-MS procedures - IDF-upmc)",null,null,"ACPI",null,"stable"]
["H2O/ACN (50/50) + 0.1% AF","other species","fruit juice","buffer_solution",null,"VARIAN","IDF_Plasma-FIA-OrbitrapNeg (API-MS procedures - IDF-upmc)","model",null,"APPI",null," "]
{"$rows_left_out":158}
{"sheet":"database_data","index":20,"n_rows":3,"n_cols":4,"rows_kept":3,"hidden":true}
["analytical matrix "]
[null,"description","key","isFav"]
[null,"","",""]

{"sheet":"MS_help","index":21,"n_rows":49,"n_cols":9,"rows_kept":49,"hidden":true}
{"$rows_empty":37}
[{"$nulls":8},"ion collision activation"]
[null,null,"Tandem type "," Activation cell"," Activation mode","Particularly name","Energy unit"]
[null,1,"QqQ/MS","q","NR","CID","eV"]
[null,2,"QqIT/MS","q or IT","NR or R","CID"," eV (meV)"]
[null,3,"Qq/TO/MS","q","NR","CID","eV"]
[null,4,"IT/TOF/MS","IT","R","CID","meV"]
[null,5,"Q/IM/Coll Cell/TOF/MS","q or IM","NR","CID"," eV"]
[null,6,"TOF/TOF/MS","coll. cell","NR","CID"," eV"]
[null,7,"Q -exactive MS","hexapole","NR","HCD","%"]
[null,8,"LTQ-OrbitrapMS","IT/Hexapole","R or NR "," CID/HCD","%"]
[null,9,"Fusion","Hex/LTQ","R or NR"," CID/HCD","%"]
[null,10,"Qh/ICR","Hex/ICR","NR or R","CID/(SORI/CID)","eV/ (meV/eV)"]